{"text_format":"1","workbook":"xlsx","n_sheets":13,"sheets":["Area Profile","Underlying Data","Background Note","Contacts","Processing","Claimant Count","Participation","Employment","ASHE","Sector","Qualifications","Education","Main Table"],"not_rendered":{"charts":8,"images":3,"macros":1,"external_links":0,"defined_names":3,"comments":0,"pivot_tables":0},"unopened":[],"bounds":{"document_bytes":16777216,"sheet_cells":100000,"rows_first":2000,"rows_last":500,"rows_between":2000,"halvings":0,"cell_chars":16384,"cell_head_chars":4096},"cells_cut":0,"cells_raw":0,"read":"whole","date_system":"1900"}

{"sheet":"Area Profile","index":0,"n_rows":104,"n_cols":12,"rows_kept":104,"cut":false,"hidden":false,"merged":[[25,1,25,5],[18,1,18,5],[25,7,25,11],[23,1,24,5],[23,7,24,11],[19,1,22,11],[103,1,104,5],[78,4,79,7],[78,8,79,11],[100,1,101,5],[99,6,100,7],[103,6,104,7],[101,6,102,7],[1,1,2,5],[54,4,56,6],[54,0,56,3],[31,1,32,5],[31,7,32,11],[54,7,56,12],[29,1,29,11],[1,7,1,11],[2,7,2,11],[3,10,3,11],[14,10,14,11],[13,10,13,11],[12,10,12,11],[11,10,11,11],[10,10,10,11],[9,10,9,11],[3,1,3,3],[3,4,3,5],[8,10,8,11],[7,10,7,11],[6,10,6,11],[3,8,3,9],[5,10,5,11],[4,10,4,11],[6,3,6,5],[5,8,5,9],[4,8,4,9],[7,8,7,9],[8,8,8,9],[6,8,6,9],[5,1,5,5],[6,1,6,2],[10,1,12,5],[7,1,9,5],[13,1,17,5],[15,7,17,11],[14,8,14,9],[9,8,9,9],[13,8,13,9],[12,8,12,9],[11,8,11,9],[10,8,10,9]]}
[]
[null,"Young Person’s Local Authority\nLabour Market Dashboard",null,null,null,null,null,{"$f":"Processing!E159","v":"565,500"}]
[null,null,null,null,null,null,null,{"$f":"Processing!E160","v":"16 to 24 year olds in Scotland"}]
[null,null,null,null,"2021-12-01",null,null,{"$f":"Processing!E161","v":"FT Education"},{"$f":"Processing!F161","v":"PT Education"},null,{"$f":"Processing!G161","v":"Not in Education"}]
[null,null,null,null,null,null,null,{"$f":"Processing!E162","v":"254,900"},{"$f":"Processing!F162","v":"19,700"},null,{"$f":"Processing!G162","v":"287,400"}]
[null,"Data for Local Authorities has been collated and can be viewed by selecting",null,null,null,null,null,{"$f":"Processing!E163","v":"(45.1 per cent)"},{"$f":"Processing!F163","v":"(3.5 per cent)"},null,{"$f":"Processing!G163","v":"(50.8 per cent)"}]
[null,"from the drop down box:",null,"Scotland",null,null,null,{"$f":"Processing!E164","v":"83,500"},{"$f":"Processing!F164","v":"15,200"},null,{"$f":"Processing!G164","v":"215,900"}]
[null,"Summary Trends in the labour market for young people are of importance given the long-term impact unemployment at a young age can have on individuals and the economy.",null,null,null,null,null,{"$f":"Processing!E165","v":"in employment"},{"$f":"Processing!F165","v":"in employment"},null,{"$f":"Processing!G165","v":"in employment"}]
[null,null,null,null,null,null,null,{"$f":"Processing!E166","v":"(14.8 per cent)"},{"$f":"Processing!F166","v":"(2.7 per cent)"},null,{"$f":"Processing!G166","v":"(38.2 per cent)"}]
[null,null,null,null,null,null,null,{"$f":"Processing!E167","v":"162,000"},{"$f":"Processing!F167","v":"3,800"},null,{"$f":"Processing!G167","v":"50,700"}]
[null,"A key policy priority is to ensure young people are provided with the opportunities to become an active part of the labour force and to maximise the benefits to them and their contribution to economic growth.",null,null,null,null,null,{"$f":"Processing!E168","v":"inactive"},{"$f":"Processing!F168","v":"inactive"},null,{"$f":"Processing!G168","v":"inactive"}]
[null,null,null,null,null,null,null,{"$f":"Processing!E169","v":"(28.7 per cent)"},{"$f":"Processing!F169","v":"(0.7 per cent)"},null,{"$f":"Processing!G169","v":"(9.0 per cent)"}]
[null,null,null,null,null,null,null,{"$f":"Processing!E170","v":"9,400"},{"$f":"Processing!F170","v":"700*"},null,{"$f":"Processing!G170","v":"20,800"}]
[null,{"$f":"Processing!E343","v":"Data for the period Jul 2020 - Jun 2021 shows that the employment rate for 16 to 24 year olds in Scotland was 51.8 per cent."},null,null,null,null,null,{"$f":"Processing!E171","v":"unemployed"},{"$f":"Processing!F171","v":"unemployed"},null,{"$f":"Processing!G171","v":"unemployed"}]
[null,null,null,null,null,null,null,{"$f":"Processing!E172","v":"(1.7 per cent)"},{"$f":"Processing!F172","v":"(0.1* per cent)"},null,{"$f":"Processing!G172","v":"(3.7 per cent)"}]
[null,null,null,null,null,null,null,"Source: Annual Population Survey, 3-Year Pooled Data, January 2018 to December 2020, ONS\nNote: All proportions based on total 16 to 24 cohort\nEducation status breakdowns do not include \"courses not stated\", \"enrolled but not attending\" or \"enrolled and not stated whether attending\" responses. However, the total estimates include all 16 to 24 year olds regardless of education status."]
[]
[]
[null,"Sample Size and Volatility"]
[null,"Many young people are students but are also looking for work.  As a result, young person's labour market data can be volatile over short time periods, and can display a wider degree of variation than other core economic and labour market indicators.  Annual Population Survey data pooled across 3-year periods has been used to reduce this volatility however small sample size means that in many cases data is still not reliable for practical purposes.\n\nNote: * Indicates estimates should be used with some caution and are based on a smaller sample sizes. Where it is not possible to provide estimates for very small groups, data are not shown or are marked by ***."]
[]
[]
[]
[null,{"$f":"Processing!E235","v":"Scotland employment, inactivity, and unemployment rates"},null,null,null,null,null,{"$f":"Processing!K236","v":"Scotland employment, inactivity, and unemployment rates"}]
[]
[null,"(16 to 24 year olds including those in full-time education)",null,null,null,null,null,"(16 to 24 year olds not in full-time education)"]
[null,"Area",null,"Employment\n(per cent)","Inactivity\n(per cent)","Unemployment\n(per cent)",null,"Area",null,"Employment\n(per cent)","Inactivity\n(per cent)","Unemployment\n(per cent)"]
[null,{"$f":"Processing!E216","v":"Scotland"},null,{"$f":"Processing!G216","v":"55.9"},{"$f":"Processing!H216","v":"38.7"},{"$f":"Processing!I216","v":"8.9"},"                                                                                                                                                                                                                                                                                                                                                                                                                                                                                                                                                                                                                                                                                                                                                                                                                                                                                                                                                                                                                                                                                                                                                                                                                                                                                                                                                                                                                                                                                                                                                                                                                                                                                                                                                                                                                                                                                                                                                                                                                                                                                                                                                                                                                                                                                                                                                                                                                                                                                                                                                                                                                                                                                                                                                                                                                                                                                                                                                                                                                                                                                                                                                                                                                                                                                                                                                                                                                                                                                                                                                                                                                                                                                                                                                                                                                                                                                                                                                                                                                                                                                                                                                                                                                                                                                                                                                                                                                                                                                                                                                                                                                                                                                                                                                                                                                                                                                                                                                                                                                                                                                                                                                                                                                                                                                                                                                                                                                                                                                                                      ",{"$f":"Processing!K216","v":"Scotland"},null,{"$f":"Processing!M216","v":"75.2"},{"$f":"Processing!N216","v":"17.9"},{"$f":"Processing!O216","v":"8.5"}]
[null,{"$f":"Processing!E217","v":""},null,{"$f":"Processing!G217","v":""},{"$f":"Processing!H217","v":""},{"$f":"Processing!I217","v":""},null,{"$f":"Processing!K217","v":""},null,{"$f":"Processing!M217","v":""},{"$f":"Processing!N217","v":""},{"$f":"Processing!O217","v":""}]
[null,"Source: Annual Population Survey, 3-Year Pooled Data, January 2018 to December 2020, ONS"]
[]
[null,{"$f":"Processing!F104","v":"1. Young person's employment rate by qualification, Scotland, \nJan 2018 to Dec 2020"},null,null,null,null,null,{"$f":"Processing!F80","v":"2. Level and proportion of young person's employment within broad Sectors, \nScotland, Jan 2018 to Dec 2020"}]
[]
[]
[]
[]
[]
[]
[]
[]
[]
[]
[]
[]
[]
[]
[]
[]
[]
[]
[]
[]
[]
[]
[{"$f":"Processing!F321","v":"3. Employment Rate for Scotland compared with Local Authority areas, Jul 2020 - Jun 2021"},null,null,null,{"$f":"Processing!F322","v":"4. Employment Rate, Scotland, Jul 2004 - Jun 2005 to Jul 2020 - Jun 2021"},null,null,{"$f":"Processing!F15","v":"5. Claimant Count levels and rates, Scotland, \nOct 2019 to Oct 2021"}]
[]
[]
[]
[]
[]
[]
[]
[]
[]
[]
[]
[]
[]
[]
[]
[]
[]
[]
[]
[]
[]
[]
[]
[null,null,null,null,{"$f":"Processing!F249","v":"6. Proportion of 16 to 19 year olds participating in employment, education, or training in Scotland, 2021"},null,null,null,{"$f":"Processing!E42","v":"7. Median Gross Weekly Earnings for full-time employees, Scotland, 2021"}]
[]
[]
[]
[]
[]
[]
[]
[]
[]
[]
[]
[]
[]
[]
[]
[]
[null,"Note:"]
[null,"With the exception of Charts 4 and 7:"]
[null,"* Estimates are considered reasonably precise but should be used with caution"]
[null,"*** Estimates are considered unreliable for practical purposes",null,null,null,null,"In Chart 7:"]
[null,null,null,null,null,null,"* Estimates are considered reasonably precise but should be used with caution"]
[null,"In Chart 4, years with a * indicate Local Authority area estimates for that year are considered reasonably precise; all Scottish estimates are considered precise."]
[null,null,null,null,null,null,"** Estimates are considered acceptable but should be used with caution"]
[]
[null,"Data within the tables and in Charts 1 and 2 cover some of the period when government policies related to COVID-19 were implemented (March 2020 onward).",null,null,null,null,"*** Estimates are considered unreliable for practical purposes"]

{"sheet":"Underlying Data","index":1,"n_rows":172,"n_cols":18,"rows_kept":172,"cut":false,"hidden":false,"merged":[[44,1,45,10],[37,1,38,16],[112,6,112,7],[113,6,113,7],[93,6,94,13],[106,6,106,7],[107,6,107,7],[108,6,108,7],[109,6,109,7],[110,6,110,7],[101,6,101,7],[102,6,102,7],[103,6,103,7],[46,8,46,10],[71,9,71,10],[70,8,70,10],[83,3,83,4],[83,6,83,7],[83,9,83,10],[56,1,57,10],[164,6,164,7],[71,6,71,7],[70,2,70,4],[70,5,70,7],[157,3,157,4],[157,6,157,7],[104,6,104,7],[105,6,105,7],[97,6,97,7],[98,6,98,7],[99,6,99,7],[100,6,100,7],[96,3,96,4],[132,1,133,4],[93,1,94,4],[21,14,21,16],[22,15,22,16],[58,5,58,7],[58,8,58,10],[59,3,59,4],[59,6,59,7],[59,9,59,10],[22,12,22,13],[22,6,22,7],[22,9,22,10],[47,3,47,4],[47,6,47,7],[58,2,58,4],[47,9,47,10],[46,2,46,4],[46,5,46,7],[1,1,2,6],[3,4,3,6],[11,1,11,2],[5,1,5,6],[6,2,6,6],[12,1,17,16],[9,1,9,16],[8,1,8,16],[96,12,96,13],[95,11,95,13],[82,5,82,7],[82,2,82,4],[83,12,83,13],[82,11,82,13],[82,8,82,10],[21,8,21,10],[21,11,21,13],[21,2,21,4],[22,3,22,4],[21,5,21,7],[71,3,71,4],[167,1,168,7],[95,2,95,4],[96,9,96,10],[95,8,95,10],[156,6,156,7],[156,3,156,4],[155,6,155,7],[111,6,111,7],[155,3,155,4],[166,3,166,4],[166,6,166,7],[165,3,165,4],[164,3,164,4],[163,2,163,4],[163,5,163,7],[165,6,165,7]]}
[]
[null,"Young Person’s Local Authority\nLabour Market Dashboard"]
[]
[null,null,null,null,"2021-12-01"]
[]
[null,"Data for Local Authorities has been collated and can be viewed by selecting"]
[null,"from the drop down box:","Scotland"]
[]
[null,"Summary Trends in the labour market for young people are of importance given the long-term impact unemployment at a young age can have on individuals and the economy."]
[null,"A key policy priority is to ensure young people are provided with the opportunities to become an active part of the labour force and to maximise the benefits to them and their contribution to economic growth."]
[]
[null,"Sample Size and Volatility"]
[null,"Many young people are students but are also looking for work.  As a result, young person's labour market data can be volatile over short time periods, and can display a wider degree of variation than other core economic and labour market indicators.  Annual Population Survey data pooled across 3-year periods has been used to reduce this volatility however small sample size means that in many cases data is still not reliable for practical purposes.\n\nNote: Shaded cells indicate estimates should be used with some caution and are based on a smaller sample sizes. Where it is not possible to provide estimates for very small groups, data are not shown or are marked by ***."]
[]
[]
[]
[]
[]
[]
[]
[null,{"$f":"Processing!E186","v":"A. Levels and proportions of economic activity for young people by education status, Scotland, Jan 2018 to Dec 2020"}]
[null,null,"All",null,null,"Employed",null,null,"Unemployed",null,null,"Inactive",null,null,"Unemployed & Inactive"]
[null,null,"Level","Proportion\n(per cent)",null,"Level","Proportion\n(per cent)",null,"Level","Proportion\n(per cent)",null,"Level","Proportion\n(per cent)",null,"Level","Proportion\n(per cent)"]
[null,{"$f":"C7","v":"Scotland"}]
[null,"In Education",{"$f":"IF(Processing!K175=\"***\",\"\",Processing!K161)","v":""},{"$f":"IF(Processing!L175=\"***\",\"\",Processing!L161)","v":""},{"$f":"IF(Processing!M175=\"***\",\"\",Processing!M161)","v":""},{"$f":"IF(Processing!N175=\"***\",\"\",Processing!N161)","v":""},{"$f":"IF(Processing!O175=\"***\",\"\",Processing!O161)","v":""},{"$f":"IF(Processing!P175=\"***\",\"\",Processing!P161)","v":""},{"$f":"IF(Processing!Q175=\"***\",\"\",Processing!Q161)","v":""},{"$f":"IF(Processing!R175=\"***\",\"\",Processing!R161)","v":""},{"$f":"IF(Processing!S175=\"***\",\"\",Processing!S161)","v":""},{"$f":"IF(Processing!T175=\"***\",\"\",Processing!T161)","v":""},{"$f":"IF(Processing!U175=\"***\",\"\",Processing!U161)","v":""},{"$f":"IF(Processing!V175=\"***\",\"\",Processing!V161)","v":""},{"$f":"IF(Processing!W175=\"***\",\"\",Processing!W161)","v":""},{"$f":"IF(Processing!X175=\"***\",\"\",Processing!X161)","v":""},{"$f":"IF(Processing!Y175=\"***\",\"\",Processing!Y161)","v":""}]
[null,"Full-Time Education",{"$f":"IF(Processing!K176=\"***\",\"\",Processing!K162)","v":"254,900"},{"$f":"IF(Processing!L176=\"***\",\"\",Processing!L162)","v":"45.1"},{"$f":"IF(Processing!M176=\"***\",\"\",Processing!M162)","v":" ± 1.5"},{"$f":"IF(Processing!N176=\"***\",\"\",Processing!N162)","v":"83,500"},{"$f":"IF(Processing!O176=\"***\",\"\",Processing!O162)","v":"14.8"},{"$f":"IF(Processing!P176=\"***\",\"\",Processing!P162)","v":" ± 1.1"},{"$f":"IF(Processing!Q176=\"***\",\"\",Processing!Q162)","v":"9,400"},{"$f":"IF(Processing!R176=\"***\",\"\",Processing!R162)","v":"1.7"},{"$f":"IF(Processing!S176=\"***\",\"\",Processing!S162)","v":" ± 0.4"},{"$f":"IF(Processing!T176=\"***\",\"\",Processing!T162)","v":"162,000"},{"$f":"IF(Processing!U176=\"***\",\"\",Processing!U162)","v":"28.7"},{"$f":"IF(Processing!V176=\"***\",\"\",Processing!V162)","v":" ± 1.4"},{"$f":"IF(Processing!W176=\"***\",\"\",Processing!W162)","v":""},{"$f":"IF(Processing!X176=\"***\",\"\",Processing!X162)","v":""},{"$f":"IF(Processing!Y176=\"***\",\"\",Processing!Y162)","v":""}]
[null,"Part-Time Education",{"$f":"IF(Processing!K177=\"***\",\"\",Processing!K163)","v":"19,700"},{"$f":"IF(Processing!L177=\"***\",\"\",Processing!L163)","v":"3.5"},{"$f":"IF(Processing!M177=\"***\",\"\",Processing!M163)","v":" ± 0.6"},{"$f":"IF(Processing!N177=\"***\",\"\",Processing!N163)","v":"15,200"},{"$f":"IF(Processing!O177=\"***\",\"\",Processing!O163)","v":"2.7"},{"$f":"IF(Processing!P177=\"***\",\"\",Processing!P163)","v":" ± 0.5"},{"$f":"IF(Processing!Q177=\"***\",\"\",Processing!Q163)","v":"700"},{"$f":"IF(Processing!R177=\"***\",\"\",Processing!R163)","v":"0.1"},{"$f":"IF(Processing!S177=\"***\",\"\",Processing!S163)","v":"#"},{"$f":"IF(Processing!T177=\"***\",\"\",Processing!T163)","v":"3,800"},{"$f":"IF(Processing!U177=\"***\",\"\",Processing!U163)","v":"0.7"},{"$f":"IF(Processing!V177=\"***\",\"\",Processing!V163)","v":" ± 0.2"},{"$f":"IF(Processing!W177=\"***\",\"\",Processing!W163)","v":""},{"$f":"IF(Processing!X177=\"***\",\"\",Processing!X163)","v":""},{"$f":"IF(Processing!Y177=\"***\",\"\",Processing!Y163)","v":""}]
[null,"Not in Education",{"$f":"IF(Processing!K178=\"***\",\"\",Processing!K164)","v":"287,400"},{"$f":"IF(Processing!L178=\"***\",\"\",Processing!L164)","v":"50.8"},{"$f":"IF(Processing!M178=\"***\",\"\",Processing!M164)","v":" ± 1.5"},{"$f":"IF(Processing!N178=\"***\",\"\",Processing!N164)","v":"215,900"},{"$f":"IF(Processing!O178=\"***\",\"\",Processing!O164)","v":"38.2"},{"$f":"IF(Processing!P178=\"***\",\"\",Processing!P164)","v":" ± 1.5"},{"$f":"IF(Processing!Q178=\"***\",\"\",Processing!Q164)","v":"20,800"},{"$f":"IF(Processing!R178=\"***\",\"\",Processing!R164)","v":"3.7"},{"$f":"IF(Processing!S178=\"***\",\"\",Processing!S164)","v":" ± 0.6"},{"$f":"IF(Processing!T178=\"***\",\"\",Processing!T164)","v":"50,700"},{"$f":"IF(Processing!U178=\"***\",\"\",Processing!U164)","v":"9.0"},{"$f":"IF(Processing!V178=\"***\",\"\",Processing!V164)","v":" ± 0.9"},{"$f":"IF(Processing!W178=\"***\",\"\",Processing!W164)","v":""},{"$f":"IF(Processing!X178=\"***\",\"\",Processing!X164)","v":""},{"$f":"IF(Processing!Y178=\"***\",\"\",Processing!Y164)","v":""}]
[null,"All",{"$f":"IF(Processing!K179=\"***\",\"\",Processing!K165)","v":"565,500"}]
[null,{"$f":"IF(C7=\"Scotland\",\"\",\"Scotland\")","v":""}]
[null,{"$f":"IF(B30=\"\",\"\",\"In Education\")","v":""},{"$f":"IF(B30=\"\",\"\",IF(Processing!K181=\"***\",\"\",Processing!K167))","v":""},{"$f":"IF(B30=\"\",\"\",IF(Processing!L181=\"***\",\"\",Processing!L167))","v":""},{"$f":"IF(B30=\"\",\"\",IF(Processing!M181=\"***\",\"\",Processing!M167))","v":""},{"$f":"IF(B30=\"\",\"\",IF(Processing!N181=\"***\",\"\",Processing!N167))","v":""},{"$f":"IF(B30=\"\",\"\",IF(Processing!O181=\"***\",\"\",Processing!O167))","v":""},{"$f":"IF(B30=\"\",\"\",IF(Processing!P181=\"***\",\"\",Processing!P167))","v":""},{"$f":"IF(B30=\"\",\"\",IF(Processing!Q181=\"***\",\"\",Processing!Q167))","v":""},{"$f":"IF(B30=\"\",\"\",IF(Processing!R181=\"***\",\"\",Processing!R167))","v":""},{"$f":"IF(B30=\"\",\"\",IF(Processing!S181=\"***\",\"\",Processing!S167))","v":""},{"$f":"IF(B30=\"\",\"\",IF(Processing!T181=\"***\",\"\",Processing!T167))","v":""},{"$f":"IF(B30=\"\",\"\",IF(Processing!U181=\"***\",\"\",Processing!U167))","v":""},{"$f":"IF(B30=\"\",\"\",IF(Processing!V181=\"***\",\"\",Processing!V167))","v":""},{"$f":"IF(B30=\"\",\"\",IF(Processing!W181=\"***\",\"\",Processing!W167))","v":""},{"$f":"IF(B30=\"\",\"\",IF(Processing!X181=\"***\",\"\",Processing!X167))","v":""},{"$f":"IF(B30=\"\",\"\",IF(Processing!Y181=\"***\",\"\",Processing!Y167))","v":""}]
[null,{"$f":"IF(B30=\"\",\"\",\"Full-Time Education\")","v":""},{"$f":"IF(B30=\"\",\"\",IF(Processing!K182=\"***\",\"\",Processing!K168))","v":""},{"$f":"IF(B30=\"\",\"\",IF(Processing!L182=\"***\",\"\",Processing!L168))","v":""},{"$f":"IF(B30=\"\",\"\",IF(Processing!M182=\"***\",\"\",Processing!M168))","v":""},{"$f":"IF(B30=\"\",\"\",IF(Processing!N182=\"***\",\"\",Processing!N168))","v":""},{"$f":"IF(B30=\"\",\"\",IF(Processing!O182=\"***\",\"\",Processing!O168))","v":""},{"$f":"IF(B30=\"\",\"\",IF(Processing!P182=\"***\",\"\",Processing!P168))","v":""},{"$f":"IF(B30=\"\",\"\",IF(Processing!Q182=\"***\",\"\",Processing!Q168))","v":""},{"$f":"IF(B30=\"\",\"\",IF(Processing!R182=\"***\",\"\",Processing!R168))","v":""},{"$f":"IF(B30=\"\",\"\",IF(Processing!S182=\"***\",\"\",Processing!S168))","v":""},{"$f":"IF(B30=\"\",\"\",IF(Processing!T182=\"***\",\"\",Processing!T168))","v":""},{"$f":"IF(B30=\"\",\"\",IF(Processing!U182=\"***\",\"\",Processing!U168))","v":""},{"$f":"IF(B30=\"\",\"\",IF(Processing!V182=\"***\",\"\",Processing!V168))","v":""},{"$f":"IF(B30=\"\",\"\",IF(Processing!W182=\"***\",\"\",Processing!W168))","v":""},{"$f":"IF(B30=\"\",\"\",IF(Processing!X182=\"***\",\"\",Processing!X168))","v":""},{"$f":"IF(B30=\"\",\"\",IF(Processing!Y182=\"***\",\"\",Processing!Y168))","v":""}]
[null,{"$f":"IF(B30=\"\",\"\",\"Part-Time Education\")","v":""},{"$f":"IF(B30=\"\",\"\",IF(Processing!K183=\"***\",\"\",Processing!K169))","v":""},{"$f":"IF(B30=\"\",\"\",IF(Processing!L183=\"***\",\"\",Processing!L169))","v":""},{"$f":"IF(B30=\"\",\"\",IF(Processing!M183=\"***\",\"\",Processing!M169))","v":""},{"$f":"IF(B30=\"\",\"\",IF(Processing!N183=\"***\",\"\",Processing!N169))","v":""},{"$f":"IF(B30=\"\",\"\",IF(Processing!O183=\"***\",\"\",Processing!O169))","v":""},{"$f":"IF(B30=\"\",\"\",IF(Processing!P183=\"***\",\"\",Processing!P169))","v":""},{"$f":"IF(B30=\"\",\"\",IF(Processing!Q183=\"***\",\"\",Processing!Q169))","v":""},{"$f":"IF(B30=\"\",\"\",IF(Processing!R183=\"***\",\"\",Processing!R169))","v":""},{"$f":"IF(B30=\"\",\"\",IF(Processing!S183=\"***\",\"\",Processing!S169))","v":""},{"$f":"IF(B30=\"\",\"\",IF(Processing!T183=\"***\",\"\",Processing!T169))","v":""},{"$f":"IF(B30=\"\",\"\",IF(Processing!U183=\"***\",\"\",Processing!U169))","v":""},{"$f":"IF(B30=\"\",\"\",IF(Processing!V183=\"***\",\"\",Processing!V169))","v":""},{"$f":"IF(B30=\"\",\"\",IF(Processing!W183=\"***\",\"\",Processing!W169))","v":""},{"$f":"IF(B30=\"\",\"\",IF(Processing!X183=\"***\",\"\",Processing!X169))","v":""},{"$f":"IF(B30=\"\",\"\",IF(Processing!Y183=\"***\",\"\",Processing!Y169))","v":""}]
[null,{"$f":"IF(B30=\"\",\"\",\"Not in Education\")","v":""},{"$f":"IF(B30=\"\",\"\",IF(Processing!K184=\"***\",\"\",Processing!K170))","v":""},{"$f":"IF(B30=\"\",\"\",IF(Processing!L184=\"***\",\"\",Processing!L170))","v":""},{"$f":"IF(B30=\"\",\"\",IF(Processing!M184=\"***\",\"\",Processing!M170))","v":""},{"$f":"IF(B30=\"\",\"\",IF(Processing!N184=\"***\",\"\",Processing!N170))","v":""},{"$f":"IF(B30=\"\",\"\",IF(Processing!O184=\"***\",\"\",Processing!O170))","v":""},{"$f":"IF(B30=\"\",\"\",IF(Processing!P184=\"***\",\"\",Processing!P170))","v":""},{"$f":"IF(B30=\"\",\"\",IF(Processing!Q184=\"***\",\"\",Processing!Q170))","v":""},{"$f":"IF(B30=\"\",\"\",IF(Processing!R184=\"***\",\"\",Processing!R170))","v":""},{"$f":"IF(B30=\"\",\"\",IF(Processing!S184=\"***\",\"\",Processing!S170))","v":""},{"$f":"IF(B30=\"\",\"\",IF(Processing!T184=\"***\",\"\",Processing!T170))","v":""},{"$f":"IF(B30=\"\",\"\",IF(Processing!U184=\"***\",\"\",Processing!U170))","v":""},{"$f":"IF(B30=\"\",\"\",IF(Processing!V184=\"***\",\"\",Processing!V170))","v":""},{"$f":"IF(B30=\"\",\"\",IF(Processing!W184=\"***\",\"\",Processing!W170))","v":""},{"$f":"IF(B30=\"\",\"\",IF(Processing!X184=\"***\",\"\",Processing!X170))","v":""},{"$f":"IF(B30=\"\",\"\",IF(Processing!Y184=\"***\",\"\",Processing!Y170))","v":""}]
[null,{"$f":"IF(B30=\"\",\"\",\"All\")","v":""},{"$f":"IF(B30=\"\",\"\",IF(Processing!K185=\"***\",\"\",Processing!K171))","v":""}]
[null,"Source: Annual Population Survey, 3-Year Pooled Data, January 2018 to December 2020, ONS"]
[null,"Note: All proportions based on total 16 to 24 cohort"]
[null,"Education status breakdowns do not include \"courses not stated\", \"enrolled but not attending\" or \"enrolled and not stated whether attending\" responses. However, the total estimates include all 16 to 24 year olds regardless of education status."]
[]
[null,"Shaded estimates are considered reasonably precise but should be used with caution."]
[null,"# Estimates have been suppressed."]
[null,"Data cover some of the period when government policies related to COVID-19 were implemented (March 2020 onward)."]
[]
[]
[null,{"$f":"Processing!E238","v":"B1. Levels and proportions of economic activity for young people including those in full-time education, \nScotland, Jan 2018 to Dec 2020"}]
[]
[null,null,"Employed",null,null,"Unemployed",null,null,"Inactive"]
[null,null,"Level","Rate (per cent)",null,"Level","Rate (per cent)",null,"Level","Rate (per cent)"]
[null,{"$f":"C7","v":"Scotland"},{"$f":"IF(Processing!G211=\"***\",\"***\",Processing!G196)","v":"315,900"},{"$f":"IF(Processing!G211=\"***\",\"***\",Processing!G201)","v":"55.9"},{"$f":"IF(Processing!G211=\"***\",\"***\",Processing!G206)","v":" ± 1.5"},{"$f":"IF(Processing!I211=\"***\",\"***\",Processing!I196)","v":"30,900"},{"$f":"IF(Processing!I211=\"***\",\"***\",Processing!I201)","v":"8.9"},{"$f":"IF(Processing!I211=\"***\",\"***\",Processing!I206)","v":" ± 1.1"},{"$f":"IF(Processing!H211=\"***\",\"***\",Processing!H196)","v":"218,800"},{"$f":"IF(Processing!H211=\"***\",\"***\",Processing!H201)","v":"38.7"},{"$f":"IF(Processing!H211=\"***\",\"***\",Processing!H206)","v":" ± 1.5"}]
[null,{"$f":"IF(C7=\"Scotland\",\"\",\"Scotland\")","v":""},{"$f":"IF(B50=\"\",\"\",IF(Processing!G212=\"***\",\"***\",Processing!G197))","v":""},{"$f":"IF(B50=\"\",\"\",IF(Processing!G212=\"***\",\"***\",Processing!G202))","v":""},{"$f":"IF(B50=\"\",\"\",IF(Processing!G212=\"***\",\"***\",Processing!G207))","v":""},{"$f":"IF(B50=\"\",\"\",IF(Processing!I212=\"***\",\"***\",Processing!I197))","v":""},{"$f":"IF(B50=\"\",\"\",IF(Processing!I212=\"***\",\"***\",Processing!I202))","v":""},{"$f":"IF(B50=\"\",\"\",IF(Processing!I212=\"***\",\"***\",Processing!I207))","v":""},{"$f":"IF(B50=\"\",\"\",IF(Processing!H212=\"***\",\"***\",Processing!H197))","v":""},{"$f":"IF(B50=\"\",\"\",IF(Processing!H212=\"***\",\"***\",Processing!H202))","v":""},{"$f":"IF(B50=\"\",\"\",IF(Processing!H212=\"***\",\"***\",Processing!H207))","v":""}]
[null,"Source: Annual Population Survey, 3-Year Pooled Data, January 2018 to December 2020, ONS"]
[null,"Shaded estimates are considered reasonably precise but should be used with caution."]
[null,"# Estimates have been suppressed."]
[null,"*** Estimates are considered unreliable for practical purposes"]
[null,"Data cover some of the period when government policies related to COVID-19 were implemented (March 2020 onward)."]
[]
[null,{"$f":"Processing!K239","v":"B2. Levels and proportions of economic activity for young people excluding those in full-time education, \nScotland, Jan 2018 to Dec 2020"}]
[]
[null,null,"Employed",null,null,"Unemployed",null,null,"Inactive"]
[null,null,"Level","Rate (per cent)",null,"Level","Rate (per cent)",null,"Level","Rate (per cent)"]
[null,{"$f":"C7","v":"Scotland"},{"$f":"IF(Processing!M211=\"***\",\"***\",Processing!M196)","v":"232,400"},{"$f":"IF(Processing!M211=\"***\",\"***\",Processing!M201)","v":"75.2"},{"$f":"IF(Processing!M211=\"***\",\"***\",Processing!M206)","v":" ± 1.8"},{"$f":"IF(Processing!O211=\"***\",\"***\",Processing!O196)","v":"21,500"},{"$f":"IF(Processing!O211=\"***\",\"***\",Processing!O201)","v":"8.5"},{"$f":"IF(Processing!O211=\"***\",\"***\",Processing!O206)","v":" ± 1.3"},{"$f":"IF(Processing!N211=\"***\",\"***\",Processing!N196)","v":"55,300"},{"$f":"IF(Processing!N211=\"***\",\"***\",Processing!N201)","v":"17.9"},{"$f":"IF(Processing!N211=\"***\",\"***\",Processing!N206)","v":" ± 1.6"}]
[null,{"$f":"IF(C7=\"Scotland\",\"\",\"Scotland\")","v":""},{"$f":"IF(B62=\"\",\"\",IF(Processing!M212=\"***\",\"***\",Processing!M197))","v":""},{"$f":"IF(B62=\"\",\"\",IF(Processing!M212=\"***\",\"***\",Processing!M202))","v":""},{"$f":"IF(B62=\"\",\"\",IF(Processing!M212=\"***\",\"***\",Processing!M207))","v":""},{"$f":"IF(B62=\"\",\"\",IF(Processing!O212=\"***\",\"***\",Processing!O197))","v":""},{"$f":"IF(B62=\"\",\"\",IF(Processing!O212=\"***\",\"***\",Processing!O202))","v":""},{"$f":"IF(B62=\"\",\"\",IF(Processing!O212=\"***\",\"***\",Processing!O207))","v":""},{"$f":"IF(B62=\"\",\"\",IF(Processing!N212=\"***\",\"***\",Processing!N197))","v":""},{"$f":"IF(B62=\"\",\"\",IF(Processing!N212=\"***\",\"***\",Processing!N202))","v":""},{"$f":"IF(B62=\"\",\"\",IF(Processing!N212=\"***\",\"***\",Processing!N207))","v":""}]
[null,"Source: Annual Population Survey, 3-Year Pooled Data, January 2018 to December 2020, ONS"]
[null,"Shaded estimates are considered reasonably precise but should be used with caution."]
[null,"# Estimates have been suppressed."]
[null,"*** Estimates are considered unreliable for practical purposes"]
[null,"Data cover some of the period when government policies related to COVID-19 were implemented (March 2020 onward)."]
[]
[]
[null,{"$f":"Processing!F105","v":"C. Young person's employment rate by qualification, Scotland, Jan 2018 to Dec 2020"}]
[null,null,"Degree, Professional Qualification, HNC/HND or equivalent",null,null,"Higher, A-Level or equivalent and National 5 grade or equivalent",null,null,"National 4 grade\nor equivalent and below¹"]
[null,null,"Level","Rate (per cent)",null,"Level","Rate (per cent)",null,"Level","Rate (per cent)"]
[null,{"$f":"C7","v":"Scotland"},{"$f":"IF(Processing!K99=\"***\",\"***\",Processing!H99)","v":109500},{"$f":"IF(Processing!K99=\"***\",\"***\",IF(Processing!I99=\"#\",\"#\",100*Processing!I99))","v":75.599999999999994},{"$f":"IF(Processing!K99=\"***\",\"***\",IF(ISNA(Processing!J99)=TRUE,\"#\",100*Processing!J99))","v":2.7},{"$f":"IF(Processing!K100=\"***\",\"***\",Processing!H100)","v":170700},{"$f":"IF(Processing!K100=\"***\",\"***\",IF(Processing!I100=\"#\",\"#\",100*Processing!I100))","v":51.6},{"$f":"IF(Processing!K100=\"***\",\"***\",IF(ISNA(Processing!J100)=TRUE,\"#\",100*Processing!J100))","v":1.9},{"$f":"IF(Processing!K101=\"***\",\"***\",Processing!H101)","v":18700},{"$f":"IF(Processing!K101=\"***\",\"***\",IF(Processing!I101=\"#\",\"#\",100*Processing!I101))","v":32.700000000000003},{"$f":"IF(Processing!K101=\"***\",\"***\",IF(ISNA(Processing!J101)=TRUE,\"#\",100*Processing!J101))","v":4.2}]
[null,{"$f":"IF(C7=\"Scotland\",\"\",\"Scotland\")","v":""},{"$f":"IF(B74=\"\",\"\",IF(Processing!T99=\"***\",\"***\",Processing!Q99))","v":""},{"$f":"IF(B74=\"\",\"\",IF(Processing!T99=\"***\",\"***\",IF(Processing!R99=\"#\",\"#\",100*Processing!R99)))","v":""},{"$f":"IF(B74=\"\",\"\",IF(Processing!T99=\"***\",\"***\",IF(ISNA(Processing!S99)=TRUE,\"#\",100*Processing!S99)))","v":""},{"$f":"IF(B74=\"\",\"\",IF(Processing!T100=\"***\",\"***\",Processing!Q100))","v":""},{"$f":"IF(B74=\"\",\"\",IF(Processing!T100=\"***\",\"***\",IF(Processing!R100=\"#\",\"#\",100*Processing!R100)))","v":""},{"$f":"IF(B74=\"\",\"\",IF(Processing!T100=\"***\",\"***\",IF(ISNA(Processing!S100)=TRUE,\"#\",100*Processing!S100)))","v":""},{"$f":"IF(B74=\"\",\"\",IF(Processing!T101=\"***\",\"***\",Processing!Q101))","v":""},{"$f":"IF(B74=\"\",\"\",IF(Processing!T101=\"***\",\"***\",IF(Processing!R101=\"#\",\"#\",100*Processing!R101)))","v":""},{"$f":"IF(B74=\"\",\"\",IF(Processing!T101=\"***\",\"***\",IF(ISNA(Processing!S101)=TRUE,\"#\",100*Processing!S101)))","v":""}]
[null,"Source: Annual Population Survey, 3-Year Pooled Data, January 2018 to December 2020, ONS"]
[null,"Shaded estimates are considered reasonably precise but should be used with caution."]
[null,"# Estimates have been suppressed."]
[null,"*** Estimates are considered unreliable for practical purposes"]
[null,"Data cover some of the period when government policies related to COVID-19 were implemented (March 2020 onward)."]
[]
[]
[null,{"$f":"Processing!F81","v":"D. Level and proportions of young person's employment within broad Sectors, Scotland, Jan 2018 to Dec 2020"}]
[null,null,{"$f":"VLOOKUP(1,Processing!$E$67:$M$70,9,FALSE)","v":"Distribution, Hotels, and Restaurants"},null,null,{"$f":"VLOOKUP(2,Processing!$E$67:$M$70,9,FALSE)","v":"Production, Agriculture, and Construction"},null,null,{"$f":"VLOOKUP(3,Processing!$E$67:$M$70,9,FALSE)","v":"Other Services"},null,null,{"$f":"VLOOKUP(4,Processing!$E$67:$M$70,9,FALSE)","v":"Public Admin, Education, and Health"}]
[null,null,"Level","Rate (per cent)",null,"Level","Rate (per cent)",null,"Level","Rate (per cent)",null,"Level","Rate (per cent)"]
[null,{"$f":"C7","v":"Scotland"},{"$f":"IF(Processing!J74=\"***\",\"***\",Processing!G74)","v":133900},{"$f":"IF(Processing!J74=\"***\",\"***\",100*Processing!H74)","v":27.800000000000004},{"$f":"IF(Processing!J74=\"***\",\"***\",IF(ISNA(Processing!I74)=TRUE,\"#\",100*Processing!I74))","v":1.3},{"$f":"IF(Processing!J75=\"***\",\"***\",Processing!G75)","v":53900},{"$f":"IF(Processing!J75=\"***\",\"***\",100*Processing!H75)","v":10},{"$f":"IF(Processing!J75=\"***\",\"***\",IF(ISNA(Processing!I75)=TRUE,\"#\",100*Processing!I75))","v":0.8},{"$f":"IF(Processing!J76=\"***\",\"***\",Processing!G76)","v":71300},{"$f":"IF(Processing!J76=\"***\",\"***\",100*Processing!H76)","v":9.5},{"$f":"IF(Processing!J76=\"***\",\"***\",IF(ISNA(Processing!I76)=TRUE,\"#\",100*Processing!I76))","v":0.70000000000000007},{"$f":"IF(Processing!J77=\"***\",\"***\",Processing!G77)","v":54900},{"$f":"IF(Processing!J77=\"***\",\"***\",100*Processing!H77)","v":6.4},{"$f":"IF(Processing!J77=\"***\",\"***\",100*IF(ISNA(Processing!I77)=TRUE,\"#\",Processing!I77))","v":0.5}]
[null,{"$f":"IF(C7=\"Scotland\",\"\",\"Scotland\")","v":""},{"$f":"IF(B86=\"\",\"\",IF(Processing!R74=\"***\",\"***\",Processing!O74))","v":""},{"$f":"IF(B86=\"\",\"\",IF(Processing!R74=\"***\",\"***\",100*Processing!P74))","v":""},{"$f":"IF(B86=\"\",\"\",IF(Processing!R74=\"***\",\"***\",IF(ISNA(Processing!Q74)=TRUE,\"#\",100*Processing!Q74)))","v":""},{"$f":"IF(B86=\"\",\"\",IF(Processing!R75=\"***\",\"***\",Processing!O75))","v":""},{"$f":"IF(B86=\"\",\"\",IF(Processing!R75=\"***\",\"***\",100*Processing!P75))","v":""},{"$f":"IF(B86=\"\",\"\",IF(Processing!R75=\"***\",\"***\",IF(ISNA(Processing!Q75)=TRUE,\"#\",100*Processing!Q75)))","v":""},{"$f":"IF(B86=\"\",\"\",IF(Processing!R76=\"***\",\"***\",Processing!O76))","v":""},{"$f":"IF(B86=\"\",\"\",IF(Processing!R76=\"***\",\"***\",100*Processing!P76))","v":""},{"$f":"IF(B86=\"\",\"\",IF(Processing!R76=\"***\",\"***\",IF(ISNA(Processing!Q76)=TRUE,\"#\",100*Processing!Q76)))","v":""},{"$f":"IF(B86=\"\",\"\",IF(Processing!R77=\"***\",\"***\",Processing!O77))","v":""},{"$f":"IF(B86=\"\",\"\",IF(Processing!R77=\"***\",\"***\",100*Processing!P77))","v":""},{"$f":"IF(B86=\"\",\"\",IF(Processing!R77=\"***\",\"***\",IF(ISNA(Processing!Q77)=TRUE,\"#\",100*Processing!Q77)))","v":""}]
[null,"Source: Annual Population Survey, 3-Year Pooled Data, January 2018 to December 2020, ONS"]
[null,"Shaded estimates are considered reasonably precise but should be used with caution."]
[null,"# Estimates have been suppressed."]
[null,"*** Estimates are considered unreliable for practical purposes"]
[null,"Data cover some of the period when government policies related to COVID-19 were implemented (March 2020 onward)."]
[]
[]
[null,{"$f":"Processing!F323","v":"E. Employment Rate for Scotland compared with Local Authority areas, Jul 2020 - Jun 2021"},null,null,null,null,{"$f":"Processing!F324","v":"F. Employment Rate, Scotland, Jul 2004 - Jun 2005 to Jul 2020 - Jun 2021"}]
[]
[null,null,"Employment",null,null,null,null,null,{"$f":"C7","v":"Scotland"},null,null,{"$f":"IF(C7=\"Scotland\",\"\",\"Scotland\")","v":""}]
[null,null,"Level","Rate (per cent)",null,null,null,null,"Level","Rate (per cent)",null,{"$f":"IF(L96=\"\",\"\",\"Level\")","v":""},{"$f":"IF(L96=\"\",\"\",\"Rate (per cent)\")","v":""}]
[null,{"$f":"Processing!Y265","v":"Highland"},{"$f":"Processing!Z265","v":14100},{"$f":"Processing!AA265","v":66.5},{"$f":"Processing!AB265","v":15.4},null,"2004/05",null,{"$f":"IF(ISNA(Processing!H302)=TRUE,\"***\",Processing!H302)","v":373400},{"$f":"IF(ISNA(Processing!I302)=TRUE,\"***\",Processing!I302)","v":63.7},{"$f":"IF(ISNA(Processing!I302)=TRUE,\"***\",Processing!J302)","v":1.3},{"$f":"IF($L$96=\"\",\"\",IF(ISNA(Processing!R302)=TRUE,\"***\",Processing!R302))","v":""},{"$f":"IF($L$96=\"\",\"\",IF(ISNA(Processing!S302)=TRUE,\"***\",Processing!S302))","v":""},{"$f":"IF($L$96=\"\",\"\",IF(ISNA(Processing!S302)=TRUE,\"***\",Processing!T302))","v":""}]
[null,{"$f":"Processing!Y266","v":"South Lanarkshire"},{"$f":"Processing!Z266","v":20600},{"$f":"Processing!AA266","v":66.5},{"$f":"Processing!AB266","v":13.200000000000001},null,"2005/06",null,{"$f":"IF(ISNA(Processing!H303)=TRUE,\"***\",Processing!H303)","v":371500},{"$f":"IF(ISNA(Processing!I303)=TRUE,\"***\",Processing!I303)","v":62.9},{"$f":"IF(ISNA(Processing!I303)=TRUE,\"***\",Processing!J303)","v":1.4000000000000001},{"$f":"IF($L$96=\"\",\"\",IF(ISNA(Processing!R303)=TRUE,\"***\",Processing!R303))","v":""},{"$f":"IF($L$96=\"\",\"\",IF(ISNA(Processing!S303)=TRUE,\"***\",Processing!S303))","v":""},{"$f":"IF($L$96=\"\",\"\",IF(ISNA(Processing!S303)=TRUE,\"***\",Processing!T303))","v":""}]
[null,{"$f":"Processing!Y267","v":"Moray"},{"$f":"Processing!Z267","v":6400},{"$f":"Processing!AA267","v":64.099999999999994},{"$f":"Processing!AB267","v":14.2},null,"2006/07",null,{"$f":"IF(ISNA(Processing!H304)=TRUE,\"***\",Processing!H304)","v":377600},{"$f":"IF(ISNA(Processing!I304)=TRUE,\"***\",Processing!I304)","v":63.4},{"$f":"IF(ISNA(Processing!I304)=TRUE,\"***\",Processing!J304)","v":1.4000000000000001},{"$f":"IF($L$96=\"\",\"\",IF(ISNA(Processing!R304)=TRUE,\"***\",Processing!R304))","v":""},{"$f":"IF($L$96=\"\",\"\",IF(ISNA(Processing!S304)=TRUE,\"***\",Processing!S304))","v":""},{"$f":"IF($L$96=\"\",\"\",IF(ISNA(Processing!S304)=TRUE,\"***\",Processing!T304))","v":""}]
[null,{"$f":"Processing!Y268","v":"North Lanarkshire"},{"$f":"Processing!Z268","v":23700},{"$f":"Processing!AA268","v":63.3},{"$f":"Processing!AB268","v":13.100000000000001},null,"2007/08",null,{"$f":"IF(ISNA(Processing!H305)=TRUE,\"***\",Processing!H305)","v":375300},{"$f":"IF(ISNA(Processing!I305)=TRUE,\"***\",Processing!I305)","v":62.3},{"$f":"IF(ISNA(Processing!I305)=TRUE,\"***\",Processing!J305)","v":1.4000000000000001},{"$f":"IF($L$96=\"\",\"\",IF(ISNA(Processing!R305)=TRUE,\"***\",Processing!R305))","v":""},{"$f":"IF($L$96=\"\",\"\",IF(ISNA(Processing!S305)=TRUE,\"***\",Processing!S305))","v":""},{"$f":"IF($L$96=\"\",\"\",IF(ISNA(Processing!S305)=TRUE,\"***\",Processing!T305))","v":""}]
[null,{"$f":"Processing!Y269","v":"East Dunbartonshire"},{"$f":"Processing!Z269","v":6600},{"$f":"Processing!AA269","v":61.9},{"$f":"Processing!AB269","v":11.799999999999999},null,"2008/09",null,{"$f":"IF(ISNA(Processing!H306)=TRUE,\"***\",Processing!H306)","v":364500},{"$f":"IF(ISNA(Processing!I306)=TRUE,\"***\",Processing!I306)","v":59.8},{"$f":"IF(ISNA(Processing!I306)=TRUE,\"***\",Processing!J306)","v":1.5},{"$f":"IF($L$96=\"\",\"\",IF(ISNA(Processing!R306)=TRUE,\"***\",Processing!R306))","v":""},{"$f":"IF($L$96=\"\",\"\",IF(ISNA(Processing!S306)=TRUE,\"***\",Processing!S306))","v":""},{"$f":"IF($L$96=\"\",\"\",IF(ISNA(Processing!S306)=TRUE,\"***\",Processing!T306))","v":""}]
[null,{"$f":"Processing!Y270","v":"Renfrewshire"},{"$f":"Processing!Z270","v":10100},{"$f":"Processing!AA270","v":59.9},{"$f":"Processing!AB270","v":13.700000000000001},null,"2009/10",null,{"$f":"IF(ISNA(Processing!H307)=TRUE,\"***\",Processing!H307)","v":340400},{"$f":"IF(ISNA(Processing!I307)=TRUE,\"***\",Processing!I307)","v":55.300000000000004},{"$f":"IF(ISNA(Processing!I307)=TRUE,\"***\",Processing!J307)","v":1.5},{"$f":"IF($L$96=\"\",\"\",IF(ISNA(Processing!R307)=TRUE,\"***\",Processing!R307))","v":""},{"$f":"IF($L$96=\"\",\"\",IF(ISNA(Processing!S307)=TRUE,\"***\",Processing!S307))","v":""},{"$f":"IF($L$96=\"\",\"\",IF(ISNA(Processing!S307)=TRUE,\"***\",Processing!T307))","v":""}]
[null,{"$f":"Processing!Y271","v":"Falkirk"},{"$f":"Processing!Z271","v":9700},{"$f":"Processing!AA271","v":57.3},{"$f":"Processing!AB271","v":14.799999999999999},null,"2010/11",null,{"$f":"IF(ISNA(Processing!H308)=TRUE,\"***\",Processing!H308)","v":344700},{"$f":"IF(ISNA(Processing!I308)=TRUE,\"***\",Processing!I308)","v":55.400000000000006},{"$f":"IF(ISNA(Processing!I308)=TRUE,\"***\",Processing!J308)","v":1.6},{"$f":"IF($L$96=\"\",\"\",IF(ISNA(Processing!R308)=TRUE,\"***\",Processing!R308))","v":""},{"$f":"IF($L$96=\"\",\"\",IF(ISNA(Processing!S308)=TRUE,\"***\",Processing!S308))","v":""},{"$f":"IF($L$96=\"\",\"\",IF(ISNA(Processing!S308)=TRUE,\"***\",Processing!T308))","v":""}]
[null,{"$f":"Processing!Y272","v":"Aberdeenshire"},{"$f":"Processing!Z272","v":14200},{"$f":"Processing!AA272","v":56.599999999999994},{"$f":"Processing!AB272","v":13.600000000000001},null,"2011/12",null,{"$f":"IF(ISNA(Processing!H309)=TRUE,\"***\",Processing!H309)","v":333300},{"$f":"IF(ISNA(Processing!I309)=TRUE,\"***\",Processing!I309)","v":53.400000000000006},{"$f":"IF(ISNA(Processing!I309)=TRUE,\"***\",Processing!J309)","v":1.6},{"$f":"IF($L$96=\"\",\"\",IF(ISNA(Processing!R309)=TRUE,\"***\",Processing!R309))","v":""},{"$f":"IF($L$96=\"\",\"\",IF(ISNA(Processing!S309)=TRUE,\"***\",Processing!S309))","v":""},{"$f":"IF($L$96=\"\",\"\",IF(ISNA(Processing!S309)=TRUE,\"***\",Processing!T309))","v":""}]
[null,{"$f":"Processing!Y273","v":"Clackmannanshire"},{"$f":"Processing!Z273","v":2900},{"$f":"Processing!AA273","v":54.6},{"$f":"Processing!AB273","v":21.3},null,"2012/13",null,{"$f":"IF(ISNA(Processing!H310)=TRUE,\"***\",Processing!H310)","v":330100},{"$f":"IF(ISNA(Processing!I310)=TRUE,\"***\",Processing!I310)","v":53.2},{"$f":"IF(ISNA(Processing!I310)=TRUE,\"***\",Processing!J310)","v":1.6},{"$f":"IF($L$96=\"\",\"\",IF(ISNA(Processing!R310)=TRUE,\"***\",Processing!R310))","v":""},{"$f":"IF($L$96=\"\",\"\",IF(ISNA(Processing!S310)=TRUE,\"***\",Processing!S310))","v":""},{"$f":"IF($L$96=\"\",\"\",IF(ISNA(Processing!S310)=TRUE,\"***\",Processing!T310))","v":""}]
[null,{"$f":"Processing!Y274","v":"East Ayrshire"},{"$f":"Processing!Z274","v":7100},{"$f":"Processing!AA274","v":54.300000000000004},{"$f":"Processing!AB274","v":13.5},null,"2013/14",null,{"$f":"IF(ISNA(Processing!H311)=TRUE,\"***\",Processing!H311)","v":321900},{"$f":"IF(ISNA(Processing!I311)=TRUE,\"***\",Processing!I311)","v":52.300000000000004},{"$f":"IF(ISNA(Processing!I311)=TRUE,\"***\",Processing!J311)","v":1.6},{"$f":"IF($L$96=\"\",\"\",IF(ISNA(Processing!R311)=TRUE,\"***\",Processing!R311))","v":""},{"$f":"IF($L$96=\"\",\"\",IF(ISNA(Processing!S311)=TRUE,\"***\",Processing!S311))","v":""},{"$f":"IF($L$96=\"\",\"\",IF(ISNA(Processing!S311)=TRUE,\"***\",Processing!T311))","v":""}]
[null,{"$f":"Processing!Y275","v":"Midlothian"},{"$f":"Processing!Z275","v":4400},{"$f":"Processing!AA275","v":52.5},{"$f":"Processing!AB275","v":16.5},null,"2014/15",null,{"$f":"IF(ISNA(Processing!H312)=TRUE,\"***\",Processing!H312)","v":336900},{"$f":"IF(ISNA(Processing!I312)=TRUE,\"***\",Processing!I312)","v":55.1},{"$f":"IF(ISNA(Processing!I312)=TRUE,\"***\",Processing!J312)","v":1.7000000000000002},{"$f":"IF($L$96=\"\",\"\",IF(ISNA(Processing!R312)=TRUE,\"***\",Processing!R312))","v":""},{"$f":"IF($L$96=\"\",\"\",IF(ISNA(Processing!S312)=TRUE,\"***\",Processing!S312))","v":""},{"$f":"IF($L$96=\"\",\"\",IF(ISNA(Processing!S312)=TRUE,\"***\",Processing!T312))","v":""}]
[null,{"$f":"Processing!Y276","v":"Na h-Eileanan Siar"},{"$f":"Processing!Z276","v":1300},{"$f":"Processing!AA276","v":52.300000000000004},{"$f":"Processing!AB276","v":22.5},null,"2015/16",null,{"$f":"IF(ISNA(Processing!H313)=TRUE,\"***\",Processing!H313)","v":339800},{"$f":"IF(ISNA(Processing!I313)=TRUE,\"***\",Processing!I313)","v":56.100000000000009},{"$f":"IF(ISNA(Processing!I313)=TRUE,\"***\",Processing!J313)","v":1.7999999999999998},{"$f":"IF($L$96=\"\",\"\",IF(ISNA(Processing!R313)=TRUE,\"***\",Processing!R313))","v":""},{"$f":"IF($L$96=\"\",\"\",IF(ISNA(Processing!S313)=TRUE,\"***\",Processing!S313))","v":""},{"$f":"IF($L$96=\"\",\"\",IF(ISNA(Processing!S313)=TRUE,\"***\",Processing!T313))","v":""}]
[null,{"$f":"Processing!Y277","v":"Scottish Borders"},{"$f":"Processing!Z277","v":6500},{"$f":"Processing!AA277","v":52.300000000000004},{"$f":"Processing!AB277","v":14.299999999999999},null,"2016/17",null,{"$f":"IF(ISNA(Processing!H314)=TRUE,\"***\",Processing!H314)","v":343000},{"$f":"IF(ISNA(Processing!I314)=TRUE,\"***\",Processing!I314)","v":57.699999999999996},{"$f":"IF(ISNA(Processing!I314)=TRUE,\"***\",Processing!J314)","v":1.9},{"$f":"IF($L$96=\"\",\"\",IF(ISNA(Processing!R314)=TRUE,\"***\",Processing!R314))","v":""},{"$f":"IF($L$96=\"\",\"\",IF(ISNA(Processing!S314)=TRUE,\"***\",Processing!S314))","v":""},{"$f":"IF($L$96=\"\",\"\",IF(ISNA(Processing!S314)=TRUE,\"***\",Processing!T314))","v":""}]
[null,{"$f":"Processing!Y278","v":"Argyll and Bute"},{"$f":"Processing!Z278","v":2900},{"$f":"Processing!AA278","v":51.5},{"$f":"Processing!AB278","v":16.8},null,"2017/18",null,{"$f":"IF(ISNA(Processing!H315)=TRUE,\"***\",Processing!H315)","v":342600},{"$f":"IF(ISNA(Processing!I315)=TRUE,\"***\",Processing!I315)","v":58.8},{"$f":"IF(ISNA(Processing!I315)=TRUE,\"***\",Processing!J315)","v":1.7999999999999998},{"$f":"IF($L$96=\"\",\"\",IF(ISNA(Processing!R315)=TRUE,\"***\",Processing!R315))","v":""},{"$f":"IF($L$96=\"\",\"\",IF(ISNA(Processing!S315)=TRUE,\"***\",Processing!S315))","v":""},{"$f":"IF($L$96=\"\",\"\",IF(ISNA(Processing!S315)=TRUE,\"***\",Processing!T315))","v":""}]
[null,{"$f":"Processing!Y279","v":"Dumfries and Galloway"},{"$f":"Processing!Z279","v":5200},{"$f":"Processing!AA279","v":49.5},{"$f":"Processing!AB279","v":15.9},null,"2018/19",null,{"$f":"IF(ISNA(Processing!H316)=TRUE,\"***\",Processing!H316)","v":337700},{"$f":"IF(ISNA(Processing!I316)=TRUE,\"***\",Processing!I316)","v":59.099999999999994},{"$f":"IF(ISNA(Processing!I316)=TRUE,\"***\",Processing!J316)","v":1.9},{"$f":"IF($L$96=\"\",\"\",IF(ISNA(Processing!R316)=TRUE,\"***\",Processing!R316))","v":""},{"$f":"IF($L$96=\"\",\"\",IF(ISNA(Processing!S316)=TRUE,\"***\",Processing!S316))","v":""},{"$f":"IF($L$96=\"\",\"\",IF(ISNA(Processing!S316)=TRUE,\"***\",Processing!T316))","v":""}]
[null,{"$f":"Processing!Y280","v":"Glasgow City"},{"$f":"Processing!Z280","v":37800},{"$f":"Processing!AA280","v":49.5},{"$f":"Processing!AB280","v":11.1},null,"2019/20",null,{"$f":"IF(ISNA(Processing!H317)=TRUE,\"***\",Processing!H317)","v":298200},{"$f":"IF(ISNA(Processing!I317)=TRUE,\"***\",Processing!I317)","v":53.1},{"$f":"IF(ISNA(Processing!I317)=TRUE,\"***\",Processing!J317)","v":2.1},{"$f":"IF($L$96=\"\",\"\",IF(ISNA(Processing!R317)=TRUE,\"***\",Processing!R317))","v":""},{"$f":"IF($L$96=\"\",\"\",IF(ISNA(Processing!S317)=TRUE,\"***\",Processing!S317))","v":""},{"$f":"IF($L$96=\"\",\"\",IF(ISNA(Processing!S317)=TRUE,\"***\",Processing!T317))","v":""}]
[null,{"$f":"Processing!Y281","v":"City of Edinburgh"},{"$f":"Processing!Z281","v":29500},{"$f":"Processing!AA281","v":49.1},{"$f":"Processing!AB281","v":11.5},null,"2020/21",null,{"$f":"IF(ISNA(Processing!H318)=TRUE,\"***\",Processing!H318)","v":285700},{"$f":"IF(ISNA(Processing!I318)=TRUE,\"***\",Processing!I318)","v":51.800000000000004},{"$f":"IF(ISNA(Processing!I318)=TRUE,\"***\",Processing!J318)","v":2.6},{"$f":"IF($L$96=\"\",\"\",IF(ISNA(Processing!R318)=TRUE,\"***\",Processing!R318))","v":""},{"$f":"IF($L$96=\"\",\"\",IF(ISNA(Processing!S318)=TRUE,\"***\",Processing!S318))","v":""},{"$f":"IF($L$96=\"\",\"\",IF(ISNA(Processing!S318)=TRUE,\"***\",Processing!T318))","v":""}]
[null,{"$f":"Processing!Y282","v":"Angus"},{"$f":"Processing!Z282","v":6300},{"$f":"Processing!AA282","v":48.699999999999996},{"$f":"Processing!AB282","v":12},null,"Source: Annual Population Survey, Jul - Jun data, ONS"]
[null,{"$f":"Processing!Y283","v":"Fife"},{"$f":"Processing!Z283","v":16300},{"$f":"Processing!AA283","v":48.6},{"$f":"Processing!AB283","v":13.600000000000001},null,"Shaded estimates are considered reasonably precise but should be used with caution."]
[null,{"$f":"Processing!Y284","v":"South Ayrshire"},{"$f":"Processing!Z284","v":4900},{"$f":"Processing!AA284","v":48.4},{"$f":"Processing!AB284","v":15.1},null,"# Estimates have been suppressed."]
[null,{"$f":"Processing!Y285","v":"East Lothian"},{"$f":"Processing!Z285","v":4400},{"$f":"Processing!AA285","v":48.1},{"$f":"Processing!AB285","v":16.100000000000001},null,"*** Estimates are considered unreliable for practical purposes"]
[null,{"$f":"Processing!Y286","v":"Inverclyde"},{"$f":"Processing!Z286","v":3600},{"$f":"Processing!AA286","v":47.9},{"$f":"Processing!AB286","v":14.6}]
[null,{"$f":"Processing!Y287","v":"West Lothian"},{"$f":"Processing!Z287","v":9500},{"$f":"Processing!AA287","v":47.9},{"$f":"Processing!AB287","v":13.700000000000001}]
[null,{"$f":"Processing!Y288","v":"Dundee City"},{"$f":"Processing!Z288","v":6800},{"$f":"Processing!AA288","v":47.8},{"$f":"Processing!AB288","v":13.3}]
[null,{"$f":"Processing!Y289","v":"North Ayrshire"},{"$f":"Processing!Z289","v":4300},{"$f":"Processing!AA289","v":43.7},{"$f":"Processing!AB289","v":16.400000000000002}]
[null,{"$f":"Processing!Y290","v":"West Dunbartonshire"},{"$f":"Processing!Z290","v":3400},{"$f":"Processing!AA290","v":42.5},{"$f":"Processing!AB290","v":15.7}]
[null,{"$f":"Processing!Y291","v":"Stirling"},{"$f":"Processing!Z291","v":4200},{"$f":"Processing!AA291","v":42},{"$f":"Processing!AB291","v":14.099999999999998}]
[null,{"$f":"Processing!Y292","v":"Perth and Kinross"},{"$f":"Processing!Z292","v":7800},{"$f":"Processing!AA292","v":41},{"$f":"Processing!AB292","v":11.899999999999999}]
[null,{"$f":"Processing!Y293","v":"East Renfrewshire"},{"$f":"Processing!Z293","v":3700},{"$f":"Processing!AA293","v":37.700000000000003},{"$f":"Processing!AB293","v":13.200000000000001}]
[null,{"$f":"Processing!Y294","v":"Aberdeen City"},{"$f":"Processing!Z294","v":6400},{"$f":"Processing!AA294","v":30},{"$f":"Processing!AB294","v":13.700000000000001}]
[null,{"$f":"Processing!Y295","v":"Orkney Islands"},{"$f":"Processing!Z295","v":"***"},{"$f":"Processing!AA295","v":"***"},{"$f":"Processing!AB295","v":"***"}]
[null,{"$f":"Processing!Y296","v":"Shetland Islands"},{"$f":"Processing!Z296","v":"***"},{"$f":"Processing!AA296","v":"***"},{"$f":"Processing!AB296","v":"***"}]
[]
[null,{"$f":"Processing!Y297","v":"Scotland"},{"$f":"Processing!Z297","v":285700},{"$f":"Processing!AA297","v":51.800000000000004},{"$f":"Processing!AB297","v":2.6}]
[null,"Source: Annual Population Survey, Jul 2020 - Jun 2021, ONS"]
[null,"Shaded estimates are considered reasonably precise but should be used with caution."]
[]
[null,"# Estimates have been suppressed."]
[null,"*** Estimates are considered unreliable for practical purposes"]
[]
[]
[null,{"$f":"Processing!F16","v":"G1. Claimant Count levels, Scotland, Oct 2019 to Oct 2021"}]
[null,null,{"$f":"Processing!H7","v":"Oct \n2019"},null,{"$f":"Processing!J7","v":"Oct \n2020"},{"$f":"Processing!K7","v":"Nov \n2020"},{"$f":"Processing!L7","v":"Dec \n2020"},{"$f":"Processing!M7","v":"Jan \n2021"},{"$f":"Processing!N7","v":"Feb \n2021"},{"$f":"Processing!O7","v":"Mar \n2021"},{"$f":"Processing!P7","v":"Apr \n2021"},{"$f":"Processing!Q7","v":"May \n2021"},{"$f":"Processing!R7","v":"Jun \n2021"},{"$f":"Processing!S7","v":"Jul \n2021"},{"$f":"Processing!T7","v":"Aug \n2021"},{"$f":"Processing!U7","v":"Sep \n2021"},{"$f":"Processing!V7","v":"Oct \n2021"},{"$f":"\"Change since \n\"&TEXT(Processing!H4,\"mmm yyyy\")","v":"Change since \nOct 2019"}]
[null,{"$f":"C7","v":"Scotland"},{"$f":"Processing!H5","v":21095},null,{"$f":"Processing!J5","v":41090},{"$f":"Processing!K5","v":40065},{"$f":"Processing!L5","v":39220},{"$f":"Processing!M5","v":38965},{"$f":"Processing!N5","v":40050},{"$f":"Processing!O5","v":40665},{"$f":"Processing!P5","v":39760},{"$f":"Processing!Q5","v":36820},{"$f":"Processing!R5","v":34060},{"$f":"Processing!S5","v":33215},{"$f":"Processing!T5","v":31315},{"$f":"Processing!U5","v":27445},{"$f":"Processing!V5","v":25480},{"$f":"Processing!I11","v":4385}]
[null,{"$f":"IF(C7=\"Scotland\",\"\",\"Scotland\")","v":""},{"$f":"IF($B$142=\"\",\"\",Processing!H6)","v":""},null,{"$f":"IF($B$142=\"\",\"\",Processing!J6)","v":""},{"$f":"IF($B$142=\"\",\"\",Processing!K6)","v":""},{"$f":"IF($B$142=\"\",\"\",Processing!L6)","v":""},{"$f":"IF($B$142=\"\",\"\",Processing!M6)","v":""},{"$f":"IF($B$142=\"\",\"\",Processing!N6)","v":""},{"$f":"IF($B$142=\"\",\"\",Processing!O6)","v":""},{"$f":"IF($B$142=\"\",\"\",Processing!P6)","v":""},{"$f":"IF($B$142=\"\",\"\",Processing!Q6)","v":""},{"$f":"IF($B$142=\"\",\"\",Processing!R6)","v":""},{"$f":"IF($B$142=\"\",\"\",Processing!S6)","v":""},{"$f":"IF($B$142=\"\",\"\",Processing!T6)","v":""},{"$f":"IF($B$142=\"\",\"\",Processing!U6)","v":""},{"$f":"IF($B$142=\"\",\"\",Processing!V6)","v":""},{"$f":"IF(B142=\"\",\"\",Processing!I12)","v":""}]
[null,"Source: Claimant Count (experimental), not seasonally adjusted."]
[null,"Rates are the proportion of the 16-24 year old population."]
[]
[null,{"$f":"Processing!F17","v":"G2. Claimant Count rates (per cent), Scotland, Oct 2019 to Oct 2021"}]
[null,null,{"$f":"Processing!H7","v":"Oct \n2019"},null,{"$f":"Processing!J7","v":"Oct \n2020"},{"$f":"Processing!K7","v":"Nov \n2020"},{"$f":"Processing!L7","v":"Dec \n2020"},{"$f":"Processing!M7","v":"Jan \n2021"},{"$f":"Processing!N7","v":"Feb \n2021"},{"$f":"Processing!O7","v":"Mar \n2021"},{"$f":"Processing!P7","v":"Apr \n2021"},{"$f":"Processing!Q7","v":"May \n2021"},{"$f":"Processing!R7","v":"Jun \n2021"},{"$f":"Processing!S7","v":"Jul \n2021"},{"$f":"Processing!T7","v":"Aug \n2021"},{"$f":"Processing!U7","v":"Sep \n2021"},{"$f":"Processing!V7","v":"Oct \n2021"},{"$f":"\"Change (p.p.) since \"&TEXT(Processing!H4,\"mmm yyyy\")","v":"Change (p.p.) since Oct 2019"}]
[null,{"$f":"C7","v":"Scotland"},{"$f":"Processing!H8","v":3.7},null,{"$f":"Processing!J8","v":7.2},{"$f":"Processing!K8","v":7.1},{"$f":"Processing!L8","v":6.9},{"$f":"Processing!M8","v":6.9},{"$f":"Processing!N8","v":7.1},{"$f":"Processing!O8","v":7.2},{"$f":"Processing!P8","v":7},{"$f":"Processing!Q8","v":6.5},{"$f":"Processing!R8","v":6},{"$f":"Processing!S8","v":5.9},{"$f":"Processing!T8","v":5.5},{"$f":"Processing!U8","v":4.8},{"$f":"Processing!V8","v":4.5},{"$f":"Processing!J11","v":0.8}]
[null,{"$f":"IF(C7=\"Scotland\",\"\",\"Scotland\")","v":""},{"$f":"IF($B$149=\"\",\"\",Processing!H9)","v":""},null,{"$f":"IF($B$149=\"\",\"\",Processing!J9)","v":""},{"$f":"IF($B$149=\"\",\"\",Processing!K9)","v":""},{"$f":"IF($B$149=\"\",\"\",Processing!L9)","v":""},{"$f":"IF($B$149=\"\",\"\",Processing!M9)","v":""},{"$f":"IF($B$149=\"\",\"\",Processing!N9)","v":""},{"$f":"IF($B$149=\"\",\"\",Processing!O9)","v":""},{"$f":"IF($B$149=\"\",\"\",Processing!P9)","v":""},{"$f":"IF($B$149=\"\",\"\",Processing!Q9)","v":""},{"$f":"IF($B$149=\"\",\"\",Processing!R9)","v":""},{"$f":"IF($B$149=\"\",\"\",Processing!S9)","v":""},{"$f":"IF($B$149=\"\",\"\",Processing!T9)","v":""},{"$f":"IF($B$149=\"\",\"\",Processing!U9)","v":""},{"$f":"IF($B$149=\"\",\"\",Processing!V9)","v":""},{"$f":"IF(B149=\"\",\"\",Processing!J12)","v":""}]
[null,"Source: Claimant Count (experimental), not seasonally adjusted."]
[null,"Rates are the proportion of the 16-24 year old population."]
[]
[]
[null,{"$f":"Processing!F250","v":"H. Proportion (per cent) of 16 to 19 year olds participating in employment, education, or training in Scotland, 2021"}]
[]
[null,null,"Education","Training and \nDevelopment",null,"Employment","Overall \nParticipation",null,"Change on \nYear (p.p.)"]
[null,{"$f":"C7","v":"Scotland"},{"$f":"Processing!G245","v":74.8},{"$f":"Processing!I245","v":1.8},null,{"$f":"Processing!H245","v":15.5},{"$f":"Processing!M245","v":"92.2"},null,{"$f":"Processing!M247","v":"0.0"}]
[null,{"$f":"IF(C7=\"Scotland\",\"\",\"Scotland\")","v":""},{"$f":"IF(B158=\"\",\"\",Processing!G246)","v":""},{"$f":"IF(B158=\"\",\"\",Processing!I246)","v":""},null,{"$f":"IF(B158=\"\",\"\",Processing!H246)","v":""},{"$f":"IF(B158=\"\",\"\",Processing!N245)","v":""},null,{"$f":"IF(B158=\"\",\"\",Processing!N247)","v":""}]
[null,"Source: Participation Measure, Skills Development Scotland, August 2021"]
[]
[]
[null,{"$f":"Processing!E43","v":"I. Median Gross Weekly Earnings for full-time employees, \nScotland, 2021"}]
[]
[null,null,"16 to 24",null,null,"16 and over"]
[null,null,"Median Pay","Change since \n2011 (per cent)",null,"Median Pay","Change since \n2011 (per cent)"]
[null,{"$f":"C7","v":"Scotland"},{"$f":"IF(Processing!K37=\"***\",\"***\",Processing!G37)","v":429.4},{"$f":"IF(OR(Processing!K37=\"***\",Processing!K38=\"***\"),\"***\",IF(Processing!G38=0,Processing!G39,Processing!G38))","v":37.6},null,{"$f":"IF(Processing!L37=\"***\",\"***\",Processing!H37)","v":622.4},{"$f":"IF(OR(Processing!L37=\"***\",Processing!L38=\"***\"),\"***\",IF(Processing!H38=0,Processing!H39,Processing!H38))","v":28.3}]
[null,{"$f":"IF(C7=\"Scotland\",\"\",\"Scotland\")","v":""},{"$f":"IF(B167=\"\",\"\",IF(Processing!L53=\"***\",\"***\",Processing!J53))","v":""},{"$f":"IF(B167=\"\",\"\",IF(OR(Processing!L53=\"***\",Processing!L54=\"***\"),\"***\",Processing!J54))","v":""},null,{"$f":"IF(B167=\"\",\"\",IF(Processing!M53=\"***\",\"***\",Processing!K53))","v":""},{"$f":"IF(B167=\"\",\"\",IF(OR(Processing!M53=\"***\",Processing!M54=\"***\"),\"***\",Processing!K54))","v":""}]
[null,"Source: Annual Survey of Hours and Earnings 2011 & 2021, ONS, Gross median weekly earnings for Full-Time employees (workplace based analysis)."]
[]
[null,"Lighter shaded estimates are considered reasonably precise but should be used with caution"]
[null,"Darker shaded estimates are considered acceptable but should be used with caution"]
[null,"*** Estimates are considered unreliable for practical purposes"]

{"sheet":"Background Note","index":2,"n_rows":86,"n_cols":16,"rows_kept":86,"cut":false,"hidden":false,"merged":[[34,1,50,13],[20,1,30,13],[31,1,33,13],[5,1,5,15],[8,1,19,13],[8,14,19,14],[8,15,19,15],[1,1,1,3],[1,5,1,9],[68,1,69,13],[70,1,84,13],[3,1,4,15],[53,15,69,15],[53,14,69,14],[70,15,86,15],[70,14,86,14],[34,15,52,15],[34,14,52,14],[85,1,86,13],[20,15,33,15],[20,14,33,14],[51,1,52,13],[53,1,67,13]]}
[]
[null,"Background Note"]
[]
[null,"There are various information sources relating to young people in the labour market shown in this dashboard for local authorities in Scotland.  Further methodological information is shown below with regard to the time period they currently refer to, frequency and timing of next update.  "]
[]
[null,"The Scottish Government publish a report on young people in the labour market each quarter using the latest data from the Annual Population Survey.  The most recent report can be viewed on the Scottish Government website."]
[]
[null,null,null,null,null,null,null,null,null,null,null,null,null,null,"Time Period","Next Update"]
[null,"Annual Population Survey 3-Year Pooled Data\nSource: Office for National Statistics \n\nArea Profile: Tables, Charts 1, and 2\nUnderlying Data: Tables A, B1, B2, C, and D\n\nSourced from the Annual Population Survey (APS) 3 year pooled data set, this produces a larger sample size over a longer period currently for 2018 to 2020.  This create a sample more than double the size of the annual APS data set.  For Scotland overall, around 4,200 of those aged 16 to 24 years are included in the 3 year pooled data set compared with around 1,600 from the annual data set (Jan - Dec 2020). For the population of all ages, the sample size is around 56,600 in the 3 year pooled compared with around 26,300 for the annual data set.\n",null,null,null,null,null,null,null,null,null,null,null,null,"January 2018\nto\nDecember 2020","Annual\nOctober 2022"]
[]
[]
[]
[]
[]
[]
[]
[]
[]
[]
[]
[null,"Annual Population Survey Annual Data\nSource: Office for National Statistics\n\nArea Profile: Charts 3 and 4\nUnderlying Data: Tables E and F\n\nThe Annual Population Survey (APS) is the National Statistics source of employment, unemployment and economic inactivity by age for Regions of the UK.  The APS has a boosted (larger) sample compared with the Labour Force Survey and therefore provides more robust estimates for local areas and smaller groups of the population (including those aged 16 to 24).",null,null,null,null,null,null,null,null,null,null,null,null,"July 2020\nto\nJune 2021\n","Quarterly\nDecember 2021"]
[]
[]
[]
[]
[]
[]
[]
[]
[]
[]
[null,"Further information, including the latest Labour Market Statistics for Young People publication, can be found on the Scottish Government Labour Market Statistics website."]
[]
[]
[null,"Claimant Count\nSource: Office for National Statistics, Department for Work and Pensions\n\nArea Profile: Chart 5\nUnderlying Data: Table G1 and G2\n\nThe experimental claimant count includes claimants of job seekers allowance and also universal credit.  The claimant count measure changed from one based solely on Jobseekers Allowance (JSA) to an experimental measure based on JSA claimants plus out-of-work Universal Credit (UC) claimants who were claiming it principally for the reason of being unemployed (those in the “searching for work” conditionality regime).\n\nThose claiming such benefits may be wholly unemployed and seeking work, or may be employed but with low income and/or low hours, that make them eligible for unemployment-related benefit support. Under UC a broader span of claimants became eligible for unemployment-related benefits than under the previous benefit regime.\n\nNote: Comparisons of pre-pandemic levels are with October 2019 as the data is not seasonally adjusted.",null,null,null,null,null,null,null,null,null,null,null,null,"2021-10-01","Monthly \nDecember 2021"]
[]
[]
[]
[]
[]
[]
[]
[]
[]
[]
[]
[]
[]
[]
[]
[]
[null,"Further information can be found on NOMIS"]
[]
[null,"Participation Measure\nSource: Skills Development Scotland (SDS)\n\nArea Profile: Chart 6\nUnderlying Data: Table H\n\nThe participation measure combines data from a range of sources including local authorities, colleges, Department for Work and Pensions (DWP), and Student Awards Agency Scotland. The annual methodology takes account of all statuses for 16 to 19 year olds in Scotland over one calendar year.  However, the closure of the economy caused by the pandemic is likely to have affected participation and the opportunities available to young adults and the choices they made.\n\nSDS have not received data from DWP about Universal Credit claimants which means it is not possible to comprehensively identify people who are unemployed and seeking work.\n",null,null,null,null,null,null,null,null,null,null,null,null,"1 April 2020\nto\n31 March 2021","Annual \nAugust 2022"]
[]
[]
[]
[]
[]
[]
[]
[]
[]
[]
[]
[]
[]
[]
[null,"Further information can be found on the Skill Development Scotland website."]
[]
[null,"Annual Survey of Hours and Earnings\nSource: Office for National Statistics\n\nArea Profile: Chart 7 \nUnderlying Data: Table I\n\nThe Annual Survey of Hours and Earnings (ASHE) is based on a 1% sample of employee jobs taken from HM Revenue and Customs Pay As You Earn (PAYE) records. Information on earnings and hours is obtained from employers and treated confidentially. ASHE does not cover the self-employed nor does it cover employees not paid during the reference period.\n\nEstimates for employees on the PAYE system on adult rates whose pay for the survey pay-period was not affected by absence. Estimates for 2021 include employees who have been furloughed under the Coronavirus Job Retention Scheme. \n",null,null,null,null,null,null,null,null,null,null,null,null,2021,"Annual \nOctober 2022"]
[]
[]
[]
[]
[]
[]
[]
[]
[]
[]
[]
[]
[]
[]
[null,"Further information can be found on the Office for National Statistics website."]

{"sheet":"Contacts","index":3,"n_rows":13,"n_cols":2,"rows_kept":13,"cut":false,"hidden":false,"merged":[[12,1,12,9],[10,1,10,9],[9,1,9,9],[1,1,1,4],[3,1,3,9],[4,1,4,9],[5,1,5,9],[7,1,7,9]]}
[]
[null,"Correspondence and enquiries"]
[]
[null,"For enquiries or any feedback on the content of this publication please contact:"]
[null,"Labour Market Analysis Unit"]
[null,"Office of the Chief Economic Advisor"]
[]
[null,"e-mail: lmstats@gov.scot"]
[]
[null,"For general enquiries about Scottish Government statistics please contact:"]
[null,"Office of the Chief Statistician"]
[]
[null,"e-mail: statistics.enquiries@gov.scot"]

{"sheet":"Processing","index":4,"n_rows":343,"n_cols":29,"rows_kept":343,"cut":false,"hidden":true,"merged":[[158,22,158,24],[172,10,172,12],[172,13,172,15],[172,16,172,18],[172,19,172,21],[172,22,172,24],[158,10,158,12],[158,13,158,15],[158,16,158,18],[158,19,158,21],[139,4,139,6],[140,4,140,6],[140,19,140,22],[139,19,139,22],[140,14,140,17],[139,14,139,17],[139,9,139,12],[140,9,140,12],[262,20,262,21],[262,18,262,19],[34,6,34,7],[34,8,34,9],[34,10,34,11],[158,4,158,6],[159,4,159,6],[96,7,96,11],[71,17,71,19],[71,9,71,11],[50,9,50,10],[50,11,50,12],[71,6,71,8],[71,14,71,16],[96,15,96,19],[118,4,118,7],[138,4,138,7],[118,9,118,12],[138,9,138,12],[118,14,118,17],[118,19,118,22],[138,14,138,17],[138,19,138,22],[120,19,120,22],[119,19,119,22],[120,14,120,17],[119,14,119,17],[120,9,120,12],[119,9,119,12],[119,4,119,7],[120,4,120,7]]}
[]
[null,"Scotland",null,null,"Claimant Count"]
[null,"Aberdeen City",null,null,{"$f":"'Area Profile'!D7","v":"Scotland"},null,null,2,null,3,4,5,6,7,8,9,10,11,12,13,14,15]
[null,"Aberdeenshire",null,null,null,null,"Levels",{"$f":"'Claimant Count'!B49","v":"2019-10-01"},null,{"$f":"'Claimant Count'!C49","v":"2020-10-01"},{"$f":"'Claimant Count'!D49","v":"2020-11-01"},{"$f":"'Claimant Count'!E49","v":"2020-12-01"},{"$f":"'Claimant Count'!F49","v":"2021-01-01"},{"$f":"'Claimant Count'!G49","v":"2021-02-01"},{"$f":"'Claimant Count'!H49","v":"2021-03-01"},{"$f":"'Claimant Count'!I49","v":"2021-04-01"},{"$f":"'Claimant Count'!J49","v":"2021-05-01"},{"$f":"'Claimant Count'!K49","v":"2021-06-01"},{"$f":"'Claimant Count'!L49","v":"2021-07-01"},{"$f":"'Claimant Count'!M49","v":"2021-08-01"},{"$f":"'Claimant Count'!N49","v":"2021-09-01"},{"$f":"'Claimant Count'!O49","v":"2021-10-01"}]
[null,"Angus",null,null,"Series",null,{"$f":"E3","v":"Scotland"},{"$f":"VLOOKUP($G$5,'Claimant Count'!$A$8:$O$41,H3,FALSE)","v":21095},null,{"$f":"VLOOKUP($G$5,'Claimant Count'!$A$8:$O$41,J3,FALSE)","v":41090},{"$f":"VLOOKUP($G$5,'Claimant Count'!$A$8:$O$41,K3,FALSE)","v":40065},{"$f":"VLOOKUP($G$5,'Claimant Count'!$A$8:$O$41,L3,FALSE)","v":39220},{"$f":"VLOOKUP($G$5,'Claimant Count'!$A$8:$O$41,M3,FALSE)","v":38965},{"$f":"VLOOKUP($G$5,'Claimant Count'!$A$8:$O$41,N3,FALSE)","v":40050},{"$f":"VLOOKUP($G$5,'Claimant Count'!$A$8:$O$41,O3,FALSE)","v":40665},{"$f":"VLOOKUP($G$5,'Claimant Count'!$A$8:$O$41,P3,FALSE)","v":39760},{"$f":"VLOOKUP($G$5,'Claimant Count'!$A$8:$O$41,Q3,FALSE)","v":36820},{"$f":"VLOOKUP($G$5,'Claimant Count'!$A$8:$O$41,R3,FALSE)","v":34060},{"$f":"VLOOKUP($G$5,'Claimant Count'!$A$8:$O$41,S3,FALSE)","v":33215},{"$f":"VLOOKUP($G$5,'Claimant Count'!$A$8:$O$41,T3,FALSE)","v":31315},{"$f":"VLOOKUP($G$5,'Claimant Count'!$A$8:$O$41,U3,FALSE)","v":27445},{"$f":"VLOOKUP($G$5,'Claimant Count'!$A$8:$O$41,V3,FALSE)","v":25480}]
[null,"Argyll and Bute",null,null,{"$f":"Processing!G5&\" \"&Processing!G4","v":"Scotland Levels"},null,{"$f":"IF($E$3=\"Scotland\",\"\",\"Scotland\")","v":""},{"$f":"IF($G$6=\"\",-1,VLOOKUP($G$6,'Claimant Count'!$A$8:$O$41,H3,FALSE))","v":-1},null,{"$f":"IF($G$6=\"\",-1,VLOOKUP($G$6,'Claimant Count'!$A$8:$O$41,J3,FALSE))","v":-1},{"$f":"IF($G$6=\"\",-1,VLOOKUP($G$6,'Claimant Count'!$A$8:$O$41,K3,FALSE))","v":-1},{"$f":"IF($G$6=\"\",-1,VLOOKUP($G$6,'Claimant Count'!$A$8:$O$41,L3,FALSE))","v":-1},{"$f":"IF($G$6=\"\",-1,VLOOKUP($G$6,'Claimant Count'!$A$8:$O$41,M3,FALSE))","v":-1},{"$f":"IF($G$6=\"\",-1,VLOOKUP($G$6,'Claimant Count'!$A$8:$O$41,N3,FALSE))","v":-1},{"$f":"IF($G$6=\"\",-1,VLOOKUP($G$6,'Claimant Count'!$A$8:$O$41,O3,FALSE))","v":-1},{"$f":"IF($G$6=\"\",-1,VLOOKUP($G$6,'Claimant Count'!$A$8:$O$41,P3,FALSE))","v":-1},{"$f":"IF($G$6=\"\",-1,VLOOKUP($G$6,'Claimant Count'!$A$8:$O$41,Q3,FALSE))","v":-1},{"$f":"IF($G$6=\"\",-1,VLOOKUP($G$6,'Claimant Count'!$A$8:$O$41,R3,FALSE))","v":-1},{"$f":"IF($G$6=\"\",-1,VLOOKUP($G$6,'Claimant Count'!$A$8:$O$41,S3,FALSE))","v":-1},{"$f":"IF($G$6=\"\",-1,VLOOKUP($G$6,'Claimant Count'!$A$8:$O$41,T3,FALSE))","v":-1},{"$f":"IF($G$6=\"\",-1,VLOOKUP($G$6,'Claimant Count'!$A$8:$O$41,U3,FALSE))","v":-1},{"$f":"IF($G$6=\"\",-1,VLOOKUP($G$6,'Claimant Count'!$A$8:$O$41,V3,FALSE))","v":-1}]
[null,"City of Edinburgh",null,null,{"$f":"Processing!G8&\" Rates\"","v":"Scotland Rates"},null,"Rates (per cent)",{"$f":"TEXT(H4,\"mmm\")&\" \n\"&TEXT(H4,\"yyyy\")","v":"Oct \n2019"},null,{"$f":"TEXT(J4,\"mmm\")&\" \n\"&TEXT(J4,\"yyyy\")","v":"Oct \n2020"},"Nov \n2020","Dec \n2020","Jan \n2021","Feb \n2021","Mar \n2021","Apr \n2021","May \n2021","Jun \n2021","Jul \n2021","Aug \n2021","Sep \n2021","Oct \n2021"]
[null,"Clackmannanshire",null,null,{"$f":"IF($E$3=\"Scotland\",\"\",Processing!G9&\" Rates\")","v":""},null,{"$f":"E3","v":"Scotland"},{"$f":"ROUND(VLOOKUP($G$8,'Claimant Count'!$A$49:$O$82,H3,FALSE),1)","v":3.7},null,{"$f":"ROUND(VLOOKUP($G$8,'Claimant Count'!$A$49:$O$82,J3,FALSE),1)","v":7.2},{"$f":"ROUND(VLOOKUP($G$8,'Claimant Count'!$A$49:$O$82,K3,FALSE),1)","v":7.1},{"$f":"ROUND(VLOOKUP($G$8,'Claimant Count'!$A$49:$O$82,L3,FALSE),1)","v":6.9},{"$f":"ROUND(VLOOKUP($G$8,'Claimant Count'!$A$49:$O$82,M3,FALSE),1)","v":6.9},{"$f":"ROUND(VLOOKUP($G$8,'Claimant Count'!$A$49:$O$82,N3,FALSE),1)","v":7.1},{"$f":"ROUND(VLOOKUP($G$8,'Claimant Count'!$A$49:$O$82,O3,FALSE),1)","v":7.2},{"$f":"ROUND(VLOOKUP($G$8,'Claimant Count'!$A$49:$O$82,P3,FALSE),1)","v":7},{"$f":"ROUND(VLOOKUP($G$8,'Claimant Count'!$A$49:$O$82,Q3,FALSE),1)","v":6.5},{"$f":"ROUND(VLOOKUP($G$8,'Claimant Count'!$A$49:$O$82,R3,FALSE),1)","v":6},{"$f":"ROUND(VLOOKUP($G$8,'Claimant Count'!$A$49:$O$82,S3,FALSE),1)","v":5.9},{"$f":"ROUND(VLOOKUP($G$8,'Claimant Count'!$A$49:$O$82,T3,FALSE),1)","v":5.5},{"$f":"ROUND(VLOOKUP($G$8,'Claimant Count'!$A$49:$O$82,U3,FALSE),1)","v":4.8},{"$f":"ROUND(VLOOKUP($G$8,'Claimant Count'!$A$49:$O$82,V3,FALSE),1)","v":4.5}]
[null,"Dumfries and Galloway",null,null,null,null,{"$f":"IF($E$3=\"Scotland\",\"\",\"Scotland\")","v":""},{"$f":"IF($E$3=\"Scotland\",-1,ROUND('Claimant Count'!B82,1))","v":-1},null,{"$f":"IF($E$3=\"Scotland\",-1,ROUND('Claimant Count'!C82,1))","v":-1},{"$f":"IF($E$3=\"Scotland\",-1,ROUND('Claimant Count'!D82,1))","v":-1},{"$f":"IF($E$3=\"Scotland\",-1,ROUND('Claimant Count'!E82,1))","v":-1},{"$f":"IF($E$3=\"Scotland\",-1,ROUND('Claimant Count'!F82,1))","v":-1},{"$f":"IF($E$3=\"Scotland\",-1,ROUND('Claimant Count'!G82,1))","v":-1},{"$f":"IF($E$3=\"Scotland\",-1,ROUND('Claimant Count'!H82,1))","v":-1},{"$f":"IF($E$3=\"Scotland\",-1,ROUND('Claimant Count'!I82,1))","v":-1},{"$f":"IF($E$3=\"Scotland\",-1,ROUND('Claimant Count'!J82,1))","v":-1},{"$f":"IF($E$3=\"Scotland\",-1,ROUND('Claimant Count'!K82,1))","v":-1},{"$f":"IF($E$3=\"Scotland\",-1,ROUND('Claimant Count'!L82,1))","v":-1},{"$f":"IF($E$3=\"Scotland\",-1,ROUND('Claimant Count'!M82,1))","v":-1},{"$f":"IF($E$3=\"Scotland\",-1,ROUND('Claimant Count'!N82,1))","v":-1},{"$f":"IF($E$3=\"Scotland\",-1,ROUND('Claimant Count'!O82,1))","v":-1}]
[null,"Dundee City",null,null,"Rank"]
[null,"East Ayrshire",null,null,{"$f":"IF($E$3=\"Scotland\",\"\",VLOOKUP(Processing!E3,'Claimant Count'!A50:Q81,17,FALSE))","v":""},null,null,"Change",{"$f":"V5-H5","v":4385},{"$f":"ROUND(VLOOKUP($G$8,'Claimant Count'!$A$49:$O$82,V3,FALSE)-VLOOKUP($G$8,'Claimant Count'!$A$49:$O$82,H3,FALSE),1)","v":0.8}]
[null,"East Dunbartonshire",null,null,null,null,null,null,{"$f":"V6-H6","v":0},{"$f":"ROUND('Claimant Count'!O82-'Claimant Count'!B82,1)","v":0.8}]
[null,"East Lothian",null,null,"Title"]
[null,"East Renfrewshire",null,null,{"$f":"TEXT(H4,\"mmm yyyy\")","v":"Oct 2019"},{"$f":"TEXT(V4, \"mmm yyyy\")","v":"Oct 2021"}]
[null,"Falkirk",null,null,"Chart",{"$f":"IF($E$3=\"Scotland\",\"5. Claimant Count levels and rates, \"&E3&\", \n\"&E14&\" to \"&F14,\"5. Claimant Count levels and rates, \n\"&E3&\" and Scotland, \"&E14&\" to \"&F14)","v":"5. Claimant Count levels and rates, Scotland, \nOct 2019 to Oct 2021"}]
[null,"Fife",null,null,"Table 1",{"$f":"IF(E3=\"Scotland\",\"G1. Claimant Count levels, \"&E3&\", \"&TEXT(H4,\"mmm yyyy\")&\" to \"&TEXT(V4,\"mmm yyyy\"),\"G1. Claimant Count levels, \"&E3&\" and Scotland, \"&TEXT(H4,\"mmm yyyy\")&\" to \"&TEXT(V4,\"mmm yyyy\"))","v":"G1. Claimant Count levels, Scotland, Oct 2019 to Oct 2021"}]
[null,"Glasgow City",null,null,"Table 2",{"$f":"IF(E3=\"Scotland\",\"G2. Claimant Count rates (per cent), \"&E3&\", \"&TEXT(H4,\"mmm yyyy\")&\" to \"&TEXT(V4,\"mmm yyyy\"),\"G2. Claimant Count rates (per cent), \"&E3&\" and Scotland, \"&TEXT(H4,\"mmm yyyy\")&\" to \"&TEXT(V4,\"mmm yyyy\"))","v":"G2. Claimant Count rates (per cent), Scotland, Oct 2019 to Oct 2021"}]
[null,"Highland"]
[null,"Inverclyde",null,null,"Text 1"]
[null,"Midlothian",null,null,{"$f":"IF(Processing!V8-Processing!H8=0,\"level\",IF(Processing!V8-Processing!H8>0,\"increased\",\"decreased\"))","v":"increased"},{"$f":"IF(E20=\"level\",\"remained at \"&TEXT(ROUND(Processing!H8,1), \"0.0\"),TEXT(E20, \"0.0\")&\" from \"&TEXT(ROUND(Processing!H8,1),\"0.0\")&\" per cent to \"&TEXT(ROUND(Processing!V8,1),\"0.0\"))","v":"increased from 3.7 per cent to 4.5"}]
[null,"Moray",null,null,{"$f":"IF($E$3=\"Scotland\",\"\",IF(Processing!V9-Processing!H9=0,\"level\",IF(Processing!V9-Processing!H9>0,\"increased\",\"decreased\")))","v":""},{"$f":"IF($E$3=\"Scotland\",\"\",IF(E21=\"level\",\"remained at \"&ROUND(ROUND(Processing!H9,1),\"0.0\"),TEXT(E21,\"0.0\")&\" from \"&TEXT(ROUND(Processing!H9,1),\"0.0\")&\" per cent to \"&TEXT(ROUND(Processing!V9,1),\"0.0\")))","v":""}]
[null,"Na h-Eileanan Siar",null,null,{"$f":"\"The Claimant Count Rate (16-24 yrs) in \"&Processing!G5&\" \"&F20&\" per cent between \"&E14&\" (pre pandemic) and \"&F14&\".  \"&IF($E$3=\"Scotland\",\"\",\"The Scotland rate \"&F21&\" per cent in the same period.\")","v":"The Claimant Count Rate (16-24 yrs) in Scotland increased from 3.7 per cent to 4.5 per cent between Oct 2019 (pre pandemic) and Oct 2021.  "}]
[null,"North Ayrshire"]
[null,"North Lanarkshire",null,null,"Text 2"]
[null,"Orkney Islands",null,null,{"$f":"IF(E11=\"\",\"\",IF(E11>16,33-E11,E11))","v":""},{"$f":"IF(OR(E25=21,E25=31),\"st\",IF(OR(E25=2,E25=22),\"nd\",IF(OR(E25=3,E25=23),\"rd\",\"th\")))","v":"th"},{"$f":"IF(E11=1,\"highest\",IF(E11=32,\"lowest\",IF(E11<17,\"highest\",\"lowest\")))","v":"lowest"}]
[null,"Perth and Kinross",null,null,{"$f":"IF(OR(E25=1,E25=1),G25,E25&F25&\" \"&G25)","v":"th lowest"}]
[null,"Renfrewshire",null,null,{"$f":"IF($E$3=\"Scotland\",\"\",E3&\" has the \"&E26&\" Claimant Count rate amongst Scottish Local Authorities.\")","v":""}]
[null,"Scottish Borders"]
[null,"Shetland Islands",null,null,"Footnote"]
[null,"South Ayrshire",null,null,"Source: Claimant Count (experimental), not seasonally adjusted. Rates are the proportion of the 16-24 year old population."]
[null,"South Lanarkshire"]
[null,"Stirling"]
[null,"West Dunbartonshire"]
[null,"West Lothian",null,null,"ASHE"]
[null,null,null,null,{"$f":"'Area Profile'!D7","v":"Scotland"},null,"Data",null,"Labels",null,"SDC"]
[null,null,null,null,null,null,"16 to 24","16 and over","16 to 24","16 and over","16 to 24","16 and over"]
[null,null,null,null,null,"Median Pay",{"$f":"IF(K37=\"***\",0,VLOOKUP(E35,ASHE!G:I,2,FALSE))","v":429.4},{"$f":"IF(L37=\"***\",0,VLOOKUP(E35,ASHE!G:I,3,FALSE))","v":622.4},{"$f":"IF(K37=\"***\",\"***\",IF(K37=\"**\",\"£\"&TEXT(G37,\"0.00\")&\"**\",IF(K37=\"*\",\"£\"&TEXT(G37,\"0.00\")&\"*\",\"£\"&TEXT(G37,\"0.00\"))))","v":"£429.40"},{"$f":"IF(L37=\"***\",\"***\",IF(L37=\"**\",\"£\"&TEXT(H37,\"0.00\")&\"**\",IF(L37=\"*\",\"£\"&TEXT(H37,\"0.00\")&\"*\",\"£\"&TEXT(H37,\"0.00\"))))","v":"£622.40"},{"$f":"VLOOKUP(E35,ASHE!G:K,4,FALSE)","v":0},{"$f":"VLOOKUP(E35,ASHE!G:K,5,FALSE)","v":0}]
[null,null,null,null,null,"Change",{"$f":"IF(OR(K37=\"***\",K38=\"***\"),0,IF(VLOOKUP(Processing!E35,ASHE!M:O,2,FALSE)>=0,VLOOKUP(Processing!E35,ASHE!M:O,2,FALSE),0))","v":37.6},{"$f":"IF(OR(L37=\"***\",L38=\"***\"),0,IF(VLOOKUP(Processing!E35,ASHE!M:O,3,FALSE)>=0,VLOOKUP(Processing!E35,ASHE!M:O,3,FALSE),0))","v":28.3},{"$f":"IF(G38=0,IF(OR(K37=\"***\",K38=\"***\"),\"***\",IF(OR(K37=\"**\",K38=\"**\"),G39&\"%**\",IF(OR(K37=\"*\",K38=\"*\"),G39&\"%*\",G39&\"%\"))),IF(OR(K37=\"***\",K38=\"***\"),\"***\",IF(OR(K37=\"**\",K38=\"**\"),G38&\"%**\",IF(OR(K37=\"*\",K38=\"*\"),G38&\"%*\",G38&\"%\"))))","v":"37.6%"},{"$f":"IF(H38=0,IF(OR(L37=\"***\",L38=\"***\"),\"***\",IF(OR(L37=\"**\",L38=\"**\"),H39&\"%**\",IF(OR(L37=\"*\",L38=\"*\"),H39&\"%*\",H39&\"%\"))),IF(OR(L37=\"***\",L38=\"***\"),\"***\",IF(OR(L37=\"**\",L38=\"**\"),H38&\"%**\",IF(OR(L37=\"*\",L38=\"*\"),H38&\"%*\",H38&\"%\"))))","v":"28.3%"},{"$f":"VLOOKUP(E35,ASHE!A:E,4,FALSE)","v":0},{"$f":"VLOOKUP(E35,ASHE!A:E,5,FALSE)","v":0}]
[null,null,null,null,null,null,{"$f":"IF(OR(K37=\"***\",K38=\"***\"),0,IF(VLOOKUP(Processing!E35,ASHE!M:O,2,FALSE)<0,VLOOKUP(Processing!E35,ASHE!M:O,2,FALSE),0))","v":0},{"$f":"IF(OR(L37=\"***\",L38=\"***\"),0,IF(VLOOKUP(Processing!E35,ASHE!M:O,3,FALSE)<0,VLOOKUP(Processing!E35,ASHE!M:O,3,FALSE),0))","v":0}]
[]
[null,null,null,null,"Title"]
[null,null,null,null,{"$f":"\"7. Median Gross Weekly Earnings for full-time employees, \"&E35&\", 2021\"","v":"7. Median Gross Weekly Earnings for full-time employees, Scotland, 2021"}]
[null,null,null,null,{"$f":"IF(E35=\"Scotland\",\"I. Median Gross Weekly Earnings for full-time employees, \n\"&E35&\", 2021\",\"I. Median Gross Weekly Earnings for full-time employees, \n\"&E35&\" and Scotland, 2021\")","v":"I. Median Gross Weekly Earnings for full-time employees, \nScotland, 2021"}]
[]
[null,null,null,null,"Text"]
[null,null,null,null,{"$f":"100*(G37-H37)/H37","v":-31.008997429305914},{"$f":"IF(OR(K37=\"***\",L37=\"***\"),\"***\",IF(OR(K37=\"**\",L37=\"**\"),\"**\",IF(OR(K37=\"*\",L37=\"*\"),\"*\",\"\")))","v":""},{"$f":"IF(E46=0,\" have the same median pay as \",IF(E46<0,\" have median pay \"&TEXT(ROUND(ABS(E46),1),\"0.0\")&F46&\" per cent less than the median pay of \",\" have median pay \"&TEXT(ROUND(ABS(E46),1),\"0.0\")&F46&\" per cent more than the median pay of \"))","v":" have median pay 31.0 per cent less than the median pay of "}]
[null,null,null,null,{"$f":"IF(OR(K37=\"***\",L37=\"***\"),\"Estimates are considered unreliable for comparing the difference between young people and those aged 16 and over in \"&E35&\".\",\"Young people who work in \"&E35&G46&\"those aged 16 and over.\")","v":"Young people who work in Scotland have median pay 31.0 per cent less than the median pay of those aged 16 and over."}]
[]
[null,null,null,null,"Y-Axis"]
[null,null,null,null,"Title (Top)","Median \nEarnings \n2021"]
[null,null,null,null,"Title (Bottom)","Change \nsince \n2011",null,null,{"$f":"IF(E35=\"Scotland\",\"\",\"Scotland\")","v":""},{"$f":"IF(I51=\"\",\"\",\"Data\")","v":""},null,{"$f":"IF(I51=\"\",\"\",\"SDC\")","v":""}]
[null,null,null,null,null,null,null,null,null,{"$f":"IF(I51=\"\",\"\",\"16 to 24\")","v":""},{"$f":"IF(I51=\"\",\"\",\"16 and over\")","v":""},{"$f":"IF(I51=\"\",\"\",\"16 to 24\")","v":""},{"$f":"IF(I51=\"\",\"\",\"16 and over\")","v":""}]
[null,null,null,null,"Min Primary",{"$f":"-F54","v":-800},{"$f":"setChartAxis(\"Area Profile\",\"ASHE_Chart\",\"Min\",\"Y\",\"Primary\",F53)","v":"Y Primary Min: -800"},null,{"$f":"IF(I51=\"\",\"\",\"Median Pay\")","v":""},{"$f":"IF(I51=\"\",\"\",ASHE!H35)","v":""},{"$f":"IF(I51=\"\",\"\",ASHE!I35)","v":""},{"$f":"IF(I51=\"\",\"\",ASHE!J35)","v":""},{"$f":"IF(I51=\"\",\"\",ASHE!K35)","v":""}]
[null,null,null,null,"Max Primary",{"$f":"ROUNDUP(MAX(G37,H37),-2)+100","v":800},{"$f":"setChartAxis(\"Area Profile\",\"ASHE_Chart\",\"Max\",\"Y\",\"Primary\",F54)","v":"Y Primary Max: 800"},null,{"$f":"IF(I51=\"\",\"\",\"Change\")","v":""},{"$f":"IF(I51=\"\",\"\",ASHE!N35)","v":""},{"$f":"IF(I51=\"\",\"\",ASHE!O35)","v":""},{"$f":"IF(I51=\"\",\"\",ASHE!D35)","v":""},{"$f":"IF(I51=\"\",\"\",ASHE!E35)","v":""}]
[null,null,null,null,"Min Secondary",{"$f":"-IF(AND(G39=0,H39=0),\n0,\nIF(AND(G38=0,H38=0),\n(ROUNDUP(MAX(ABS(G38),ABS(H38),ABS(G39),ABS(H39)),1)+10),\nF56/3))","v":0},{"$f":"setChartAxis(\"Area Profile\",\"ASHE_Chart\",\"Min\",\"Y\",\"Secondary\",F55)","v":"Y Secondary Min: 0"}]
[null,null,null,null,"Max Secondary",{"$f":"IF(AND(G39=0,H39=0),\n2*(ROUNDUP(MAX(ABS(G38),ABS(H38),ABS(G39),ABS(H39)),1)+10),\nIF(AND(G38=0,H38=0),\n80,\n3*(ROUNDUP(MAX(ABS(G38),ABS(H38),ABS(G39),ABS(H39)),1)+10)))","v":95.2},{"$f":"setChartAxis(\"Area Profile\",\"ASHE_Chart\",\"Max\",\"Y\",\"Secondary\",F56)","v":"Y Secondary Max: 95.2"}]
[]
[null,null,null,null,"Footnote"]
[null,null,null,null,"Source: Annual Survey of Hours and Earnings 2011 & 2021, ONS, Gross median weekly earnings for Full-Time employees (workplace based analysis)."]
[]
[]
[]
[null,null,null,null,"SECTOR"]
[null,null,null,null,{"$f":"'Area Profile'!D7","v":"Scotland"}]
[]
[null,null,null,null,"Rank",null,null,null,"Total","Rate","CI","SDC",null,null,"Total","Rate","CI","SDC"]
[null,null,null,null,{"$f":"_xlfn.RANK.EQ(J67,$J$67:$J$70)+COUNTIF($J$67:J67,J67)-1","v":2},"A - F: Production, Agriculture & Construction",{"$f":"$E$64&F67","v":"ScotlandA - F: Production, Agriculture & Construction"},"Production, \nAgriculture, and \nConstruction",{"$f":"VLOOKUP(G67,Sector!A:G,4,FALSE)","v":53900},{"$f":"VLOOKUP(G67,Sector!A:G,5,FALSE)","v":0.1},{"$f":"IF(VLOOKUP(G67,Sector!A:G,6,FALSE)=\".\",NA(),VLOOKUP(G67,Sector!A:G,6,FALSE))","v":8.0000000000000002E-3},{"$f":"VLOOKUP(G67,Sector!A:G,7,FALSE)","v":0},"Production, Agriculture, and Construction",{"$f":"\"Scotland\"&F67","v":"ScotlandA - F: Production, Agriculture & Construction"},{"$f":"VLOOKUP(N67,Sector!A:G,4,FALSE)","v":53900},{"$f":"VLOOKUP(N67,Sector!A:G,5,FALSE)","v":0.1},{"$f":"IF(VLOOKUP(N67,Sector!A:G,6,FALSE)=\".\",NA(),VLOOKUP(N67,Sector!A:G,6,FALSE))","v":8.0000000000000002E-3},{"$f":"VLOOKUP(N67,Sector!A:G,7,FALSE)","v":0}]
[null,null,null,null,{"$f":"_xlfn.RANK.EQ(J68,$J$67:$J$70)+COUNTIF($J$67:J68,J68)-1","v":1},"G, I: Distribution, Hotels & Restaurants",{"$f":"$E$64&F68","v":"ScotlandG, I: Distribution, Hotels & Restaurants"},"Distribution, \nHotels, and \nRestaurants",{"$f":"VLOOKUP(G68,Sector!A:G,4,FALSE)","v":133900},{"$f":"VLOOKUP(G68,Sector!A:G,5,FALSE)","v":0.27800000000000002},{"$f":"IF(VLOOKUP(G68,Sector!A:G,6,FALSE)=\".\",NA(),VLOOKUP(G68,Sector!A:G,6,FALSE))","v":1.2999999999999999E-2},{"$f":"VLOOKUP(G68,Sector!A:G,7,FALSE)","v":0},"Distribution, Hotels, and Restaurants",{"$f":"\"Scotland\"&F68","v":"ScotlandG, I: Distribution, Hotels & Restaurants"},{"$f":"VLOOKUP(N68,Sector!A:G,4,FALSE)","v":133900},{"$f":"VLOOKUP(N68,Sector!A:G,5,FALSE)","v":0.27800000000000002},{"$f":"IF(VLOOKUP(N68,Sector!A:G,6,FALSE)=\".\",NA(),VLOOKUP(N68,Sector!A:G,6,FALSE))","v":1.2999999999999999E-2},{"$f":"VLOOKUP(N68,Sector!A:G,7,FALSE)","v":0}]
[null,null,null,null,{"$f":"_xlfn.RANK.EQ(J69,$J$67:$J$70)+COUNTIF($J$67:J69,J69)-1","v":3},"H, J - N, R - U: Other Services",{"$f":"$E$64&F69","v":"ScotlandH, J - N, R - U: Other Services"},"Other Services",{"$f":"VLOOKUP(G69,Sector!A:G,4,FALSE)","v":71300},{"$f":"VLOOKUP(G69,Sector!A:G,5,FALSE)","v":9.5000000000000001E-2},{"$f":"IF(VLOOKUP(G69,Sector!A:G,6,FALSE)=\".\",NA(),VLOOKUP(G69,Sector!A:G,6,FALSE))","v":7.0000000000000001E-3},{"$f":"VLOOKUP(G69,Sector!A:G,7,FALSE)","v":0},"Other Services",{"$f":"\"Scotland\"&F69","v":"ScotlandH, J - N, R - U: Other Services"},{"$f":"VLOOKUP(N69,Sector!A:G,4,FALSE)","v":71300},{"$f":"VLOOKUP(N69,Sector!A:G,5,FALSE)","v":9.5000000000000001E-2},{"$f":"IF(VLOOKUP(N69,Sector!A:G,6,FALSE)=\".\",NA(),VLOOKUP(N69,Sector!A:G,6,FALSE))","v":7.0000000000000001E-3},{"$f":"VLOOKUP(N69,Sector!A:G,7,FALSE)","v":0}]
[null,null,null,null,{"$f":"_xlfn.RANK.EQ(J70,$J$67:$J$70)+COUNTIF($J$67:J70,J70)-1","v":4},"O - Q: Public Admin, Education & Health",{"$f":"$E$64&F70","v":"ScotlandO - Q: Public Admin, Education & Health"},"Public Admin, \nEducation, \nand Health",{"$f":"VLOOKUP(G70,Sector!A:G,4,FALSE)","v":54900},{"$f":"VLOOKUP(G70,Sector!A:G,5,FALSE)","v":6.4000000000000001E-2},{"$f":"IF(VLOOKUP(G70,Sector!A:G,6,FALSE)=\".\",NA(),VLOOKUP(G70,Sector!A:G,6,FALSE))","v":5.0000000000000001E-3},{"$f":"VLOOKUP(G70,Sector!A:G,7,FALSE)","v":0},"Public Admin, Education, and Health",{"$f":"\"Scotland\"&F70","v":"ScotlandO - Q: Public Admin, Education & Health"},{"$f":"VLOOKUP(N70,Sector!A:G,4,FALSE)","v":54900},{"$f":"VLOOKUP(N70,Sector!A:G,5,FALSE)","v":6.4000000000000001E-2},{"$f":"IF(VLOOKUP(N70,Sector!A:G,6,FALSE)=\".\",NA(),VLOOKUP(N70,Sector!A:G,6,FALSE))","v":5.0000000000000001E-3},{"$f":"VLOOKUP(N70,Sector!A:G,7,FALSE)","v":0}]
[]
[null,null,null,null,null,null,{"$f":"E64&\" Data\"","v":"Scotland Data"},null,null,{"$f":"E64&\" Labels\"","v":"Scotland Labels"},null,null,null,null,"Scotland Data",null,null,"Scotland Labels"]
[null,null,null,null,null,null,"Total","Rate","CI","SDC","Total","Rate",null,null,"Total","Rate","CI","SDC","Total","Rate"]
[null,null,null,null,1,{"$f":"VLOOKUP(E74,$E$67:$H$70,4,FALSE)","v":"Distribution, \nHotels, and \nRestaurants"},{"$f":"VLOOKUP(F74,$H$67:$L$70,2,FALSE)","v":133900},{"$f":"VLOOKUP(F74,$H$67:$L$70,3,FALSE)","v":0.27800000000000002},{"$f":"IF(J74=\"***\",NA(),VLOOKUP(F74,$H$67:$L$70,4,FALSE))","v":1.2999999999999999E-2},{"$f":"IF(VLOOKUP(F74,$H$67:$L$70,5,FALSE)=0,\"\",VLOOKUP(F74,$H$67:$L$70,5,FALSE))","v":""},{"$f":"IF(J74=\"\",TEXT(G74,\"#,##0\"),IF(J74=\"*\",TEXT(G74,\"#,##0\")&J74,\"\"))","v":"133,900"},{"$f":"IF(J74=\"\",TEXT(100*H74, \"0.0\")&\"%\n\",IF(J74=\"*\",TEXT(100*H74, \"0.0\")&\"%\"&J74&\"\n\",J74))","v":"27.8%\n"},null,{"$f":"F74","v":"Distribution, \nHotels, and \nRestaurants"},{"$f":"VLOOKUP(N74,$H$67:$R$70,8,FALSE)","v":133900},{"$f":"VLOOKUP(N74,$H$67:$R$70,9,FALSE)","v":0.27800000000000002},{"$f":"VLOOKUP(N74,$H$67:$R$70,10,FALSE)","v":1.2999999999999999E-2},{"$f":"IF(VLOOKUP(N74,$H$67:$R$70,11,FALSE)=0,\"\",VLOOKUP(N74,$H$67:$R$70,11,FALSE))","v":""},null,{"$f":"IF($E$64=\"Scotland\",\"\",IF(R74=\"\",TEXT(100*P74, \"0.0\")&\"%\",IF(R74=\"*\",TEXT(100*P74, \"0.0\")&\"%\"&R74,R74)))","v":""}]
[null,null,null,null,2,{"$f":"VLOOKUP(E75,$E$67:$H$70,4,FALSE)","v":"Production, \nAgriculture, and \nConstruction"},{"$f":"VLOOKUP(F75,$H$67:$L$70,2,FALSE)","v":53900},{"$f":"VLOOKUP(F75,$H$67:$L$70,3,FALSE)","v":0.1},{"$f":"IF(J75=\"***\",NA(),VLOOKUP(F75,$H$67:$L$70,4,FALSE))","v":8.0000000000000002E-3},{"$f":"IF(VLOOKUP(F75,$H$67:$L$70,5,FALSE)=0,\"\",VLOOKUP(F75,$H$67:$L$70,5,FALSE))","v":""},{"$f":"IF(J75=\"\",TEXT(G75,\"#,##0\"),IF(J75=\"*\",TEXT(G75,\"#,##0\")&J75,\"\"))","v":"53,900"},{"$f":"IF(J75=\"\",TEXT(100*H75, \"0.0\")&\"%\n\",IF(J75=\"*\",TEXT(100*H75, \"0.0\")&\"%\"&J75&\"\n\",J75))","v":"10.0%\n"},null,{"$f":"F75","v":"Production, \nAgriculture, and \nConstruction"},{"$f":"VLOOKUP(N75,$H$67:$R$70,8,FALSE)","v":53900},{"$f":"VLOOKUP(N75,$H$67:$R$70,9,FALSE)","v":0.1},{"$f":"VLOOKUP(N75,$H$67:$R$70,10,FALSE)","v":8.0000000000000002E-3},{"$f":"IF(VLOOKUP(N75,$H$67:$R$70,11,FALSE)=0,\"\",VLOOKUP(N75,$H$67:$R$70,11,FALSE))","v":""},null,{"$f":"IF($E$64=\"Scotland\",\"\",IF(R75=\"\",TEXT(100*P75, \"0.0\")&\"%\",IF(R75=\"*\",TEXT(100*P75, \"0.0\")&\"%\"&R75,R75)))","v":""}]
[null,null,null,null,3,{"$f":"VLOOKUP(E76,$E$67:$H$70,4,FALSE)","v":"Other Services"},{"$f":"VLOOKUP(F76,$H$67:$L$70,2,FALSE)","v":71300},{"$f":"VLOOKUP(F76,$H$67:$L$70,3,FALSE)","v":9.5000000000000001E-2},7.0000000000000001E-3,{"$f":"IF(VLOOKUP(F76,$H$67:$L$70,5,FALSE)=0,\"\",VLOOKUP(F76,$H$67:$L$70,5,FALSE))","v":""},{"$f":"IF(J76=\"\",TEXT(G76,\"#,##0\"),IF(J76=\"*\",TEXT(G76,\"#,##0\")&J76,\"\"))","v":"71,300"},{"$f":"IF(J76=\"\",TEXT(100*H76, \"0.0\")&\"%\n\",IF(J76=\"*\",TEXT(100*H76, \"0.0\")&\"%\"&J76&\"\n\",J76))","v":"9.5%\n"},null,{"$f":"F76","v":"Other Services"},{"$f":"VLOOKUP(N76,$H$67:$R$70,8,FALSE)","v":71300},{"$f":"VLOOKUP(N76,$H$67:$R$70,9,FALSE)","v":9.5000000000000001E-2},{"$f":"VLOOKUP(N76,$H$67:$R$70,10,FALSE)","v":7.0000000000000001E-3},{"$f":"IF(VLOOKUP(N76,$H$67:$R$70,11,FALSE)=0,\"\",VLOOKUP(N76,$H$67:$R$70,11,FALSE))","v":""},null,""]
[null,null,null,null,4,{"$f":"VLOOKUP(E77,$E$67:$H$70,4,FALSE)","v":"Public Admin, \nEducation, \nand Health"},{"$f":"VLOOKUP(F77,$H$67:$L$70,2,FALSE)","v":54900},{"$f":"VLOOKUP(F77,$H$67:$L$70,3,FALSE)","v":6.4000000000000001E-2},5.0000000000000001E-3,{"$f":"IF(VLOOKUP(F77,$H$67:$L$70,5,FALSE)=0,\"\",VLOOKUP(F77,$H$67:$L$70,5,FALSE))","v":""},{"$f":"IF(J77=\"\",TEXT(G77,\"#,##0\"),IF(J77=\"*\",TEXT(G77,\"#,##0\")&J77,\"\"))","v":"54,900"},{"$f":"IF(J77=\"\",TEXT(100*H77, \"0.0\")&\"%\n\",IF(J77=\"*\",TEXT(100*H77, \"0.0\")&\"%\"&J77&\"\n\",J77))","v":"6.4%\n"},null,{"$f":"F77","v":"Public Admin, \nEducation, \nand Health"},{"$f":"VLOOKUP(N77,$H$67:$R$70,8,FALSE)","v":54900},{"$f":"VLOOKUP(N77,$H$67:$R$70,9,FALSE)","v":6.4000000000000001E-2},{"$f":"VLOOKUP(N77,$H$67:$R$70,10,FALSE)","v":5.0000000000000001E-3},{"$f":"IF(VLOOKUP(N77,$H$67:$R$70,11,FALSE)=0,\"\",VLOOKUP(N77,$H$67:$R$70,11,FALSE))","v":""},null,""]
[]
[null,null,null,null,"Title"]
[null,null,null,null,"Chart",{"$f":"\"2. Level and proportion of young person's employment within broad Sectors, \n\"&E64&\", Jan 2018 to Dec 2020\"","v":"2. Level and proportion of young person's employment within broad Sectors, \nScotland, Jan 2018 to Dec 2020"}]
[null,null,null,null,"Table",{"$f":"IF(E64=\"Scotland\",\"D. Level and proportions of young person's employment within broad Sectors, \"&E64&\", Jan 2018 to Dec 2020\",\"D. Level and proportions of young person's employment within broad Sectors, \"&E64&\" and Scotland, Jan 2018 to Dec 2020\")","v":"D. Level and proportions of young person's employment within broad Sectors, Scotland, Jan 2018 to Dec 2020"}]
[null,null,null,null,"Scotland Series",{"$f":"IF($E$64=\"Scotland\",\"\",\"Scotland\")","v":""}]
[]
[null,null,null,null,"Text"]
[null,null,null,null,{"$f":"IF(J74=\"***\",\"Estimates for \"&E64&\" are considered unreliable for practical purposes.\",\"People aged 16 to 24 make up \"&TEXT(100*H74,\"0.0\")&J74&\" per cent of the \"&VLOOKUP(1,E67:R70,9,FALSE)&\" sector in \"&E64&\".\")","v":"People aged 16 to 24 make up 27.8 per cent of the Distribution, Hotels, and Restaurants sector in Scotland."}]
[]
[null,null,null,null,"Footnote"]
[null,null,null,null,"Source: Annual Population Survey, 3-Year Pooled Data, January 2018 to December 2020, ONS"]
[]
[null,null,null,null,"X-Axis"]
[null,null,null,null,0,{"$f":"setChartAxis(\"Area Profile\",\"SECTOR_Chart\",\"Min\",\"Y\",\"Primary\",E91)","v":"Y Primary Min: 0"}]
[null,null,null,null,{"$f":"ROUNDUP(MAX($H$74:$H$77)+MAX(IF(ISNUMBER($I$74:$I$77),$I$74:$I$77))+0.15,2)","v":0.45},{"$f":"setChartAxis(\"Area Profile\",\"SECTOR_Chart\",\"Max\",\"Y\",\"Primary\",E92)","v":"Y Primary Max: 0.45"}]
[]
[]
[]
[null,null,null,null,"QUALIFICATIONS"]
[null,null,null,null,{"$f":"'Area Profile'!D7","v":"Scotland"},null,null,{"$f":"E97","v":"Scotland"},null,null,null,null,null,null,null,{"$f":"IF(E97=\"Scotland\",\"\",\"Scotland\")","v":""}]
[null,null,null,null,null,null,null,"Level","Rate","CI","SDC","Label 1","Label 2","Rank",null,null,"Level","Rate","CI","SDC","Label"]
[null,null,null,null,"Degree, Professional Qualification, \nHNC/HND or equivalent","1: SVQ Level 4 and 5",{"$f":"$E$97&F99","v":"Scotland1: SVQ Level 4 and 5"},{"$f":"IF(VLOOKUP(G99,Qualifications!A:G,4,FALSE)=\".\",\"#\",VLOOKUP(G99,Qualifications!A:G,4,FALSE))","v":109500},{"$f":"IF(VLOOKUP(G99,Qualifications!A:G,5,FALSE)=\".\",\"#\",VLOOKUP(G99,Qualifications!A:G,5,FALSE))","v":0.75600000000000001},{"$f":"IF(VLOOKUP(G99,Qualifications!A:G,6,FALSE)=\".\",NA(),VLOOKUP(G99,Qualifications!A:G,6,FALSE))","v":2.7E-2},{"$f":"IF(VLOOKUP(G99,Qualifications!A:G,7,FALSE)=0,\"\",VLOOKUP(G99,Qualifications!A:G,7,FALSE))","v":""},{"$f":"IF(K99=\"***\",\"\",IF(K99=\"*\",TEXT(100*I99,\"0.0\")&\"%*\",IF(I99=\"#\",\"\",TEXT(100*I99,\"0.0\")&\"%\")))","v":"75.6%"},{"$f":"IF(L99=\"\",IF(K99=\"***\",\"***\",\"#\"),\"\")","v":""},{"$f":"_xlfn.RANK.EQ(I99,$I$99:$I$101)","v":1},"Degree, Professional Qualification, \nHNC/HND or equivalent","Degree, Professional Qualification, HNC/HND or equivalent",{"$f":"IF($E$97=\"Scotland\",\"\",VLOOKUP(\"Scotland\"&F99,Qualifications!A:G,4,FALSE))","v":""},{"$f":"IF($E$97=\"Scotland\",\"\",VLOOKUP(\"Scotland\"&F99,Qualifications!A:G,5,FALSE))","v":""},{"$f":"IF($E$97=\"Scotland\",\"\",IF(VLOOKUP(\"Scotland\"&F99,Qualifications!A:G,6,FALSE)=\".\",NA(),VLOOKUP(\"Scotland\"&F99,Qualifications!A:G,6,FALSE)))","v":""},{"$f":"IF(VLOOKUP(\"Scotland\"&F99,Qualifications!A:G,7,FALSE)=0,\"\",VLOOKUP(\"Scotland\"&F99,Qualifications!A:G,7,FALSE))","v":""},{"$f":"IF($E$97=\"Scotland\",\"\",IF(T99=\"***\",\"***\",IF(T99=\"*\",TEXT(100*R99, \"0.0\")&\"%*\",TEXT(100*R99, \"0.0\")&\"%\")))","v":""}]
[null,null,null,null,"Higher, A-Level or equivalent and \nNational 5 grade or equivalent","2: SVQ Level 2 and 3",{"$f":"$E$97&F100","v":"Scotland2: SVQ Level 2 and 3"},{"$f":"IF(VLOOKUP(G100,Qualifications!A:G,4,FALSE)=\".\",\"#\",VLOOKUP(G100,Qualifications!A:G,4,FALSE))","v":170700},{"$f":"IF(VLOOKUP(G100,Qualifications!A:G,5,FALSE)=\".\",\"#\",VLOOKUP(G100,Qualifications!A:G,5,FALSE))","v":0.51600000000000001},{"$f":"IF(VLOOKUP(G100,Qualifications!A:G,6,FALSE)=\".\",NA(),VLOOKUP(G100,Qualifications!A:G,6,FALSE))","v":1.9E-2},{"$f":"IF(VLOOKUP(G100,Qualifications!A:G,7,FALSE)=0,\"\",VLOOKUP(G100,Qualifications!A:G,7,FALSE))","v":""},{"$f":"IF(K100=\"***\",\"\",IF(K100=\"*\",TEXT(100*I100,\"0.0\")&\"%*\",IF(I100=\"#\",\"\",TEXT(100*I100,\"0.0\")&\"%\")))","v":"51.6%"},{"$f":"IF(L100=\"\",IF(K100=\"***\",\"***\",\"#\"),\"\")","v":""},{"$f":"_xlfn.RANK.EQ(I100,$I$99:$I$101)","v":2},"Higher, A-Level or equivalent and \nNational 5 grade or equivalent","Higher, A-Level or equivalent and National 5 grade or equivalent",{"$f":"IF($E$97=\"Scotland\",\"\",VLOOKUP(\"Scotland\"&F100,Qualifications!A:G,4,FALSE))","v":""},{"$f":"IF($E$97=\"Scotland\",\"\",VLOOKUP(\"Scotland\"&F100,Qualifications!A:G,5,FALSE))","v":""},{"$f":"IF($E$97=\"Scotland\",\"\",IF(VLOOKUP(\"Scotland\"&F100,Qualifications!A:G,6,FALSE)=\".\",NA(),VLOOKUP(\"Scotland\"&F100,Qualifications!A:G,6,FALSE)))","v":""},{"$f":"IF(VLOOKUP(\"Scotland\"&F100,Qualifications!A:G,7,FALSE)=0,\"\",VLOOKUP(\"Scotland\"&F100,Qualifications!A:G,7,FALSE))","v":""},{"$f":"IF($E$97=\"Scotland\",\"\",IF(T100=\"***\",\"***\",IF(T100=\"*\",TEXT(100*R100, \"0.0\")&\"%*\",TEXT(100*R100, \"0.0\")&\"%\")))","v":""}]
[null,null,null,null,"National 4 Grade \nor equivalent and below¹","3: SVQ Level 1 and None",{"$f":"$E$97&F101","v":"Scotland3: SVQ Level 1 and None"},{"$f":"IF(VLOOKUP(G101,Qualifications!A:G,4,FALSE)=\".\",\"#\",VLOOKUP(G101,Qualifications!A:G,4,FALSE))","v":18700},{"$f":"IF(VLOOKUP(G101,Qualifications!A:G,5,FALSE)=\".\",\"#\",VLOOKUP(G101,Qualifications!A:G,5,FALSE))","v":0.32700000000000001},{"$f":"IF(VLOOKUP(G101,Qualifications!A:G,6,FALSE)=\".\",NA(),VLOOKUP(G101,Qualifications!A:G,6,FALSE))","v":4.2000000000000003E-2},{"$f":"IF(VLOOKUP(G101,Qualifications!A:G,7,FALSE)=0,\"\",VLOOKUP(G101,Qualifications!A:G,7,FALSE))","v":""},{"$f":"IF(K101=\"***\",\"\",IF(K101=\"*\",TEXT(100*I101,\"0.0\")&\"%*\",IF(I101=\"#\",\"\",TEXT(100*I101,\"0.0\")&\"%\")))","v":"32.7%"},"",{"$f":"_xlfn.RANK.EQ(I101,$I$99:$I$101)","v":3},"National 4 Grade \nor equivalent and below¹","National 4 Grade or equivalent and below¹",{"$f":"IF($E$97=\"Scotland\",\"\",VLOOKUP(\"Scotland\"&F101,Qualifications!A:G,4,FALSE))","v":""},{"$f":"IF($E$97=\"Scotland\",\"\",VLOOKUP(\"Scotland\"&F101,Qualifications!A:G,5,FALSE))","v":""},{"$f":"IF($E$97=\"Scotland\",\"\",IF(VLOOKUP(\"Scotland\"&F101,Qualifications!A:G,6,FALSE)=\".\",NA(),VLOOKUP(\"Scotland\"&F101,Qualifications!A:G,6,FALSE)))","v":""},{"$f":"IF(VLOOKUP(\"Scotland\"&F101,Qualifications!A:G,7,FALSE)=0,\"\",VLOOKUP(\"Scotland\"&F101,Qualifications!A:G,7,FALSE))","v":""},{"$f":"IF($E$97=\"Scotland\",\"\",IF(T101=\"***\",\"***\",IF(T101=\"*\",TEXT(100*R101, \"0.0\")&\"%*\",TEXT(100*R101, \"0.0\")&\"%\")))","v":""}]
[]
[null,null,null,null,"Title",null,null,null,null,null,{"$f":"3-(IF(K99=\"***\",1,0)+IF(K100=\"***\",1,0)+IF(K101=\"***\",1,0))","v":3},{"$f":"VLOOKUP(1,N99:O101,2,FALSE)","v":"Degree, Professional Qualification, \nHNC/HND or equivalent"},null,{"$f":"COUNTIFS(N99:N101,1)","v":1}]
[null,null,null,null,"Chart",{"$f":"\"1. Young person's employment rate by qualification, \"&E97&\", \nJan 2018 to Dec 2020\"","v":"1. Young person's employment rate by qualification, Scotland, \nJan 2018 to Dec 2020"},null,null,null,null,null,{"$f":"100*VLOOKUP(L103,E99:I101,5,FALSE)&VLOOKUP(L103,E99:K101,7,FALSE)","v":"75.6"},null,{"$f":"IF(OR(AND(K103=3,N103=1),AND(K103=2,N103=1)),\"higher than\",IF(AND(K103=1,N103=1),\"only one\",IF(OR(AND(K103=2,N103=2),AND(K103=3,N103,2)),\"same as another\",IF(AND(K103=3,N103=3),\"same as all\",\"N/A\"))))","v":"higher than"},"higher than",", higher than those with alternative qualifications."]
[null,null,null,null,"Table",{"$f":"IF(E97=\"Scotland\",\"C. Young person's employment rate by qualification, \"&E97&\", Jan 2018 to Dec 2020\",\"C. Young person's employment rate by qualification, \"&E97&\" and Scotland, Jan 2018 to Dec 2020\")","v":"C. Young person's employment rate by qualification, Scotland, Jan 2018 to Dec 2020"},null,null,null,null,null,null,null,null,"only one","."]
[null,null,null,null,null,null,null,null,null,null,null,null,null,{"$f":"VLOOKUP(1,N99:P101,3,TRUE)","v":"Degree, Professional Qualification, HNC/HND or equivalent"},"same as another",{"$f":"\", the same as \"&N106&\".\"","v":", the same as Degree, Professional Qualification, HNC/HND or equivalent."}]
[null,null,null,null,"Text",null,null,null,null,null,null,null,null,null,"same as all",", the same as those with alternative qualifications."]
[null,null,null,null,{"$f":"VLOOKUP(1,N99:P101,3,FALSE)","v":"Degree, Professional Qualification, HNC/HND or equivalent"}]
[null,null,null,null,{"$f":"IF(N104=\"N/A\",\"Data for \"&E97&\" is considered unreliable for estimating the proportion of young people with different qualifications.\",\"The employment rate of \"&E97&\" for young people with \"&E108&\" qualifications was \"&L104&\" per cent\"&VLOOKUP(N104,O104:P107,2,FALSE))","v":"The employment rate of Scotland for young people with Degree, Professional Qualification, HNC/HND or equivalent qualifications was 75.6 per cent, higher than those with alternative qualifications."}]
[]
[null,null,null,null,"Footnote"]
[null,null,null,null,"Source: Annual Population Survey, 3-Year Pooled Data, \nJanuary 2018 to December 2020, ONS \n1. Includes those with no qualifications\n# Estimates have been suppressed"]
[]
[]
[]
[null,null,null,null,"MAIN TABLE"]
[null,null,null,null,{"$f":"'Area Profile'!D7","v":"Scotland"}]
[]
[null,null,null,null,"Area Values",null,null,null,null,"Area SDC",null,null,null,null,"Area CI",null,null,null,null,"Area Look-Up Columns"]
[null,null,null,null,{"$f":"TEXT(VLOOKUP($E$117,'Main Table'!$A$2:$BX$37,T120,FALSE),\"#,##0\")","v":"565,500"},null,null,null,null,{"$f":"IF(ISBLANK(VLOOKUP($E$117,'Main Table'!$A$39:$BX$74,T120,FALSE))=TRUE,\"\",VLOOKUP($E$117,'Main Table'!$A$39:$BX$74,T120,FALSE))","v":""},null,null,null,null,null,null,null,null,null,2]
[null,null,null,null,{"$f":"\"16 to 24 year olds in \"&$E$117","v":"16 to 24 year olds in Scotland"},null,null,null,null,{"$f":"\"16 to 24 year olds in \"&$E$117","v":"16 to 24 year olds in Scotland"},null,null,null,null,{"$f":"\"16 to 24 year olds in \"&$E$117","v":"16 to 24 year olds in Scotland"},null,null,null,null,{"$f":"\"16 to 24 year olds in \"&$E$117","v":"16 to 24 year olds in Scotland"}]
[null,null,null,null,"FT Education","PT Education","Not in Education","All Education",null,"FT Education","PT Education","Not in Education","All Education",null,"FT Education","PT Education","Not in Education","All Education",null,"FT Education","PT Education","Not in Education","All Education"]
[null,null,null,null,{"$f":"TEXT(VLOOKUP($E$117,'Main Table'!$A$2:$BX$37,T123,FALSE),\"#,##0\")","v":"254,900"},{"$f":"TEXT(VLOOKUP($E$117,'Main Table'!$A$2:$BX$37,U123,FALSE),\"#,##0\")","v":"19,700"},{"$f":"TEXT(VLOOKUP($E$117,'Main Table'!$A$2:$BX$37,V123,FALSE),\"#,##0\")","v":"287,400"},{"$f":"TEXT(VLOOKUP($E$117,'Main Table'!$A$2:$BX$37,W123,FALSE),\"#,##0\")","v":"274,500"},null,{"$f":"IF(ISBLANK(VLOOKUP($E$117,'Main Table'!$A$39:$BX$74,T123,FALSE))=TRUE,\"\",VLOOKUP($E$117,'Main Table'!$A$39:$BX$74,T123,FALSE))","v":""},{"$f":"IF(ISBLANK(VLOOKUP($E$117,'Main Table'!$A$39:$BX$74,U123,FALSE))=TRUE,\"\",VLOOKUP($E$117,'Main Table'!$A$39:$BX$74,U123,FALSE))","v":""},{"$f":"IF(ISBLANK(VLOOKUP($E$117,'Main Table'!$A$39:$BX$74,V123,FALSE))=TRUE,\"\",VLOOKUP($E$117,'Main Table'!$A$39:$BX$74,V123,FALSE))","v":""},{"$f":"IF(ISBLANK(VLOOKUP($E$117,'Main Table'!$A$39:$BX$74,W123,FALSE))=TRUE,\"\",VLOOKUP($E$117,'Main Table'!$A$39:$BX$74,W123,FALSE))","v":""},null,null,null,null,null,null,8,14,11,5]
[null,null,null,null,{"$f":"TEXT(100*VLOOKUP($E$117,'Main Table'!$A$2:$BX$37,T124,FALSE),\"0.0\")","v":"45.1"},{"$f":"TEXT(100*VLOOKUP($E$117,'Main Table'!$A$2:$BX$37,U124,FALSE),\"0.0\")","v":"3.5"},{"$f":"TEXT(100*VLOOKUP($E$117,'Main Table'!$A$2:$BX$37,V124,FALSE),\"0.0\")","v":"50.8"},{"$f":"TEXT(100*VLOOKUP($E$117,'Main Table'!$A$2:$BX$37,W124,FALSE),\"0.0\")","v":"48.5"},null,{"$f":"IF(ISBLANK(VLOOKUP($E$117,'Main Table'!$A$39:$BX$74,T124,FALSE))=TRUE,\"\",VLOOKUP($E$117,'Main Table'!$A$39:$BX$74,T124,FALSE))","v":""},{"$f":"IF(ISBLANK(VLOOKUP($E$117,'Main Table'!$A$39:$BX$74,U124,FALSE))=TRUE,\"\",VLOOKUP($E$117,'Main Table'!$A$39:$BX$74,U124,FALSE))","v":""},{"$f":"IF(ISBLANK(VLOOKUP($E$117,'Main Table'!$A$39:$BX$74,V124,FALSE))=TRUE,\"\",VLOOKUP($E$117,'Main Table'!$A$39:$BX$74,V124,FALSE))","v":""},{"$f":"IF(ISBLANK(VLOOKUP($E$117,'Main Table'!$A$39:$BX$74,W124,FALSE))=TRUE,\"\",VLOOKUP($E$117,'Main Table'!$A$39:$BX$74,W124,FALSE))","v":""},null,{"$f":"IF(VLOOKUP($E$117,'Main Table'!$A$2:$BX$37,T124+1,FALSE)=\".\",\"#\",TEXT(100*VLOOKUP($E$117,'Main Table'!$A$2:$BX$37,T124+1,FALSE),\" ± 0.0\"))","v":" ± 1.5"},{"$f":"IF(VLOOKUP($E$117,'Main Table'!$A$2:$BX$37,U124+1,FALSE)=\".\",\"#\",TEXT(100*VLOOKUP($E$117,'Main Table'!$A$2:$BX$37,U124+1,FALSE),\" ± 0.0\"))","v":" ± 0.6"},{"$f":"IF(VLOOKUP($E$117,'Main Table'!$A$2:$BX$37,V124+1,FALSE)=\".\",\"#\",TEXT(100*VLOOKUP($E$117,'Main Table'!$A$2:$BX$37,V124+1,FALSE),\" ± 0.0\"))","v":" ± 1.5"},{"$f":"IF(VLOOKUP($E$117,'Main Table'!$A$2:$BX$37,W124+1,FALSE)=\".\",\"#\",TEXT(100*VLOOKUP($E$117,'Main Table'!$A$2:$BX$37,W124+1,FALSE),\" ± 0.0\"))","v":" ± 1.5"},null,9,15,12,6]
[null,null,null,null,{"$f":"TEXT(VLOOKUP($E$117,'Main Table'!$A$2:$BX$37,T125,FALSE),\"#,##0\")","v":"83,500"},{"$f":"TEXT(VLOOKUP($E$117,'Main Table'!$A$2:$BX$37,U125,FALSE),\"#,##0\")","v":"15,200"},{"$f":"TEXT(VLOOKUP($E$117,'Main Table'!$A$2:$BX$37,V125,FALSE),\"#,##0\")","v":"215,900"},{"$f":"TEXT(VLOOKUP($E$117,'Main Table'!$A$2:$BX$37,W125,FALSE),\"#,##0\")","v":"98,700"},null,{"$f":"IF(ISBLANK(VLOOKUP($E$117,'Main Table'!$A$39:$BX$74,T125,FALSE))=TRUE,\"\",VLOOKUP($E$117,'Main Table'!$A$39:$BX$74,T125,FALSE))","v":""},{"$f":"IF(ISBLANK(VLOOKUP($E$117,'Main Table'!$A$39:$BX$74,U125,FALSE))=TRUE,\"\",VLOOKUP($E$117,'Main Table'!$A$39:$BX$74,U125,FALSE))","v":""},{"$f":"IF(ISBLANK(VLOOKUP($E$117,'Main Table'!$A$39:$BX$74,V125,FALSE))=TRUE,\"\",VLOOKUP($E$117,'Main Table'!$A$39:$BX$74,V125,FALSE))","v":""},{"$f":"IF(ISBLANK(VLOOKUP($E$117,'Main Table'!$A$39:$BX$74,W125,FALSE))=TRUE,\"\",VLOOKUP($E$117,'Main Table'!$A$39:$BX$74,W125,FALSE))","v":""},null,null,null,null,null,null,23,29,26,20]
[null,null,null,null,"in employment","in employment","in employment","in employment",null,"in employment","in employment","in employment","in employment",null,"in employment","in employment","in employment","in employment"]
[null,null,null,null,{"$f":"TEXT(100*VLOOKUP($E$117,'Main Table'!$A$2:$BX$37,T127,FALSE),\"0.0\")","v":"14.8"},{"$f":"TEXT(100*VLOOKUP($E$117,'Main Table'!$A$2:$BX$37,U127,FALSE),\"0.0\")","v":"2.7"},{"$f":"TEXT(100*VLOOKUP($E$117,'Main Table'!$A$2:$BX$37,V127,FALSE),\"0.0\")","v":"38.2"},{"$f":"TEXT(100*VLOOKUP($E$117,'Main Table'!$A$2:$BX$37,W127,FALSE),\"0.0\")","v":"17.5"},null,{"$f":"IF(ISBLANK(VLOOKUP($E$117,'Main Table'!$A$39:$BX$74,T127,FALSE))=TRUE,\"\",VLOOKUP($E$117,'Main Table'!$A$39:$BX$74,T127,FALSE))","v":""},{"$f":"IF(ISBLANK(VLOOKUP($E$117,'Main Table'!$A$39:$BX$74,U127,FALSE))=TRUE,\"\",VLOOKUP($E$117,'Main Table'!$A$39:$BX$74,U127,FALSE))","v":""},{"$f":"IF(ISBLANK(VLOOKUP($E$117,'Main Table'!$A$39:$BX$74,V127,FALSE))=TRUE,\"\",VLOOKUP($E$117,'Main Table'!$A$39:$BX$74,V127,FALSE))","v":""},{"$f":"IF(ISBLANK(VLOOKUP($E$117,'Main Table'!$A$39:$BX$74,W127,FALSE))=TRUE,\"\",VLOOKUP($E$117,'Main Table'!$A$39:$BX$74,W127,FALSE))","v":""},null,{"$f":"IF(VLOOKUP($E$117,'Main Table'!$A$2:$BX$37,T127+1,FALSE)=\".\",\"#\",TEXT(100*VLOOKUP($E$117,'Main Table'!$A$2:$BX$37,T127+1,FALSE),\" ± 0.0\"))","v":" ± 1.1"},{"$f":"IF(VLOOKUP($E$117,'Main Table'!$A$2:$BX$37,U127+1,FALSE)=\".\",\"#\",TEXT(100*VLOOKUP($E$117,'Main Table'!$A$2:$BX$37,U127+1,FALSE),\" ± 0.0\"))","v":" ± 0.5"},{"$f":"IF(VLOOKUP($E$117,'Main Table'!$A$2:$BX$37,V127+1,FALSE)=\".\",\"#\",TEXT(100*VLOOKUP($E$117,'Main Table'!$A$2:$BX$37,V127+1,FALSE),\" ± 0.0\"))","v":" ± 1.5"},{"$f":"IF(VLOOKUP($E$117,'Main Table'!$A$2:$BX$37,W127+1,FALSE)=\".\",\"#\",TEXT(100*VLOOKUP($E$117,'Main Table'!$A$2:$BX$37,W127+1,FALSE),\" ± 0.0\"))","v":" ± 1.1"},null,24,30,27,21]
[null,null,null,null,{"$f":"TEXT(VLOOKUP($E$117,'Main Table'!$A$2:$BX$37,T128,FALSE),\"#,##0\")","v":"162,000"},{"$f":"TEXT(VLOOKUP($E$117,'Main Table'!$A$2:$BX$37,U128,FALSE),\"#,##0\")","v":"3,800"},{"$f":"TEXT(VLOOKUP($E$117,'Main Table'!$A$2:$BX$37,V128,FALSE),\"#,##0\")","v":"50,700"},{"$f":"TEXT(VLOOKUP($E$117,'Main Table'!$A$2:$BX$37,W128,FALSE),\"#,##0\")","v":"165,800"},null,{"$f":"IF(ISBLANK(VLOOKUP($E$117,'Main Table'!$A$39:$BX$74,T128,FALSE))=TRUE,\"\",VLOOKUP($E$117,'Main Table'!$A$39:$BX$74,T128,FALSE))","v":""},{"$f":"IF(ISBLANK(VLOOKUP($E$117,'Main Table'!$A$39:$BX$74,U128,FALSE))=TRUE,\"\",VLOOKUP($E$117,'Main Table'!$A$39:$BX$74,U128,FALSE))","v":""},{"$f":"IF(ISBLANK(VLOOKUP($E$117,'Main Table'!$A$39:$BX$74,V128,FALSE))=TRUE,\"\",VLOOKUP($E$117,'Main Table'!$A$39:$BX$74,V128,FALSE))","v":""},{"$f":"IF(ISBLANK(VLOOKUP($E$117,'Main Table'!$A$39:$BX$74,W128,FALSE))=TRUE,\"\",VLOOKUP($E$117,'Main Table'!$A$39:$BX$74,W128,FALSE))","v":""},null,null,null,null,null,null,53,59,56,50]
[null,null,null,null,"inactive","inactive","inactive","inactive",null,"inactive","inactive","inactive","inactive",null,"inactive","inactive","inactive","inactive"]
[null,null,null,null,{"$f":"TEXT(100*VLOOKUP($E$117,'Main Table'!$A$2:$BX$37,T130,FALSE),\"0.0\")","v":"28.7"},{"$f":"TEXT(100*VLOOKUP($E$117,'Main Table'!$A$2:$BX$37,U130,FALSE),\"0.0\")","v":"0.7"},{"$f":"TEXT(100*VLOOKUP($E$117,'Main Table'!$A$2:$BX$37,V130,FALSE),\"0.0\")","v":"9.0"},{"$f":"TEXT(100*VLOOKUP($E$117,'Main Table'!$A$2:$BX$37,W130,FALSE),\"0.0\")","v":"29.3"},null,{"$f":"IF(ISBLANK(VLOOKUP($E$117,'Main Table'!$A$39:$BX$74,T130,FALSE))=TRUE,\"\",VLOOKUP($E$117,'Main Table'!$A$39:$BX$74,T130,FALSE))","v":""},{"$f":"IF(ISBLANK(VLOOKUP($E$117,'Main Table'!$A$39:$BX$74,U130,FALSE))=TRUE,\"\",VLOOKUP($E$117,'Main Table'!$A$39:$BX$74,U130,FALSE))","v":""},{"$f":"IF(ISBLANK(VLOOKUP($E$117,'Main Table'!$A$39:$BX$74,V130,FALSE))=TRUE,\"\",VLOOKUP($E$117,'Main Table'!$A$39:$BX$74,V130,FALSE))","v":""},{"$f":"IF(ISBLANK(VLOOKUP($E$117,'Main Table'!$A$39:$BX$74,W130,FALSE))=TRUE,\"\",VLOOKUP($E$117,'Main Table'!$A$39:$BX$74,W130,FALSE))","v":""},null,{"$f":"IF(VLOOKUP($E$117,'Main Table'!$A$2:$BX$37,T130+1,FALSE)=\".\",\"#\",TEXT(100*VLOOKUP($E$117,'Main Table'!$A$2:$BX$37,T130+1,FALSE),\" ± 0.0\"))","v":" ± 1.4"},{"$f":"IF(VLOOKUP($E$117,'Main Table'!$A$2:$BX$37,U130+1,FALSE)=\".\",\"#\",TEXT(100*VLOOKUP($E$117,'Main Table'!$A$2:$BX$37,U130+1,FALSE),\" ± 0.0\"))","v":" ± 0.2"},{"$f":"IF(VLOOKUP($E$117,'Main Table'!$A$2:$BX$37,V130+1,FALSE)=\".\",\"#\",TEXT(100*VLOOKUP($E$117,'Main Table'!$A$2:$BX$37,V130+1,FALSE),\" ± 0.0\"))","v":" ± 0.9"},{"$f":"IF(VLOOKUP($E$117,'Main Table'!$A$2:$BX$37,W130+1,FALSE)=\".\",\"#\",TEXT(100*VLOOKUP($E$117,'Main Table'!$A$2:$BX$37,W130+1,FALSE),\" ± 0.0\"))","v":" ± 1.4"},null,54,60,57,51]
[null,null,null,null,{"$f":"TEXT(VLOOKUP($E$117,'Main Table'!$A$2:$BX$37,T131,FALSE),\"#,##0\")","v":"9,400"},{"$f":"TEXT(VLOOKUP($E$117,'Main Table'!$A$2:$BX$37,U131,FALSE),\"#,##0\")","v":"700"},{"$f":"TEXT(VLOOKUP($E$117,'Main Table'!$A$2:$BX$37,V131,FALSE),\"#,##0\")","v":"20,800"},{"$f":"TEXT(VLOOKUP($E$117,'Main Table'!$A$2:$BX$37,W131,FALSE),\"#,##0\")","v":"10,000"},null,{"$f":"IF(ISBLANK(VLOOKUP($E$117,'Main Table'!$A$39:$BX$74,T131,FALSE))=TRUE,\"\",VLOOKUP($E$117,'Main Table'!$A$39:$BX$74,T131,FALSE))","v":""},{"$f":"IF(ISBLANK(VLOOKUP($E$117,'Main Table'!$A$39:$BX$74,U131,FALSE))=TRUE,\"\",VLOOKUP($E$117,'Main Table'!$A$39:$BX$74,U131,FALSE))","v":"*"},{"$f":"IF(ISBLANK(VLOOKUP($E$117,'Main Table'!$A$39:$BX$74,V131,FALSE))=TRUE,\"\",VLOOKUP($E$117,'Main Table'!$A$39:$BX$74,V131,FALSE))","v":""},{"$f":"IF(ISBLANK(VLOOKUP($E$117,'Main Table'!$A$39:$BX$74,W131,FALSE))=TRUE,\"\",VLOOKUP($E$117,'Main Table'!$A$39:$BX$74,W131,FALSE))","v":""},null,null,null,null,null,null,38,44,41,35]
[null,null,null,null,"unemployed","unemployed","unemployed","unemployed",null,"unemployed","unemployed","unemployed","unemployed",null,"unemployed","unemployed","unemployed","unemployed"]
[null,null,null,null,{"$f":"TEXT(100*VLOOKUP($E$117,'Main Table'!$A$2:$BX$37,T133,FALSE),\"0.0\")","v":"1.7"},{"$f":"TEXT(100*VLOOKUP($E$117,'Main Table'!$A$2:$BX$37,U133,FALSE),\"0.0\")","v":"0.1"},{"$f":"TEXT(100*VLOOKUP($E$117,'Main Table'!$A$2:$BX$37,V133,FALSE),\"0.0\")","v":"3.7"},{"$f":"TEXT(100*VLOOKUP($E$117,'Main Table'!$A$2:$BX$37,W133,FALSE),\"0.0\")","v":"1.8"},null,{"$f":"IF(ISBLANK(VLOOKUP($E$117,'Main Table'!$A$39:$BX$74,T133,FALSE))=TRUE,\"\",VLOOKUP($E$117,'Main Table'!$A$39:$BX$74,T133,FALSE))","v":""},{"$f":"IF(ISBLANK(VLOOKUP($E$117,'Main Table'!$A$39:$BX$74,U133,FALSE))=TRUE,\"\",VLOOKUP($E$117,'Main Table'!$A$39:$BX$74,U133,FALSE))","v":"*"},{"$f":"IF(ISBLANK(VLOOKUP($E$117,'Main Table'!$A$39:$BX$74,V133,FALSE))=TRUE,\"\",VLOOKUP($E$117,'Main Table'!$A$39:$BX$74,V133,FALSE))","v":""},{"$f":"IF(ISBLANK(VLOOKUP($E$117,'Main Table'!$A$39:$BX$74,W133,FALSE))=TRUE,\"\",VLOOKUP($E$117,'Main Table'!$A$39:$BX$74,W133,FALSE))","v":""},null,{"$f":"IF(VLOOKUP($E$117,'Main Table'!$A$2:$BX$37,T133+1,FALSE)=\".\",\"#\",TEXT(100*VLOOKUP($E$117,'Main Table'!$A$2:$BX$37,T133+1,FALSE),\" ± 0.0\"))","v":" ± 0.4"},{"$f":"IF(VLOOKUP($E$117,'Main Table'!$A$2:$BX$37,U133+1,FALSE)=\".\",\"#\",TEXT(100*VLOOKUP($E$117,'Main Table'!$A$2:$BX$37,U133+1,FALSE),\" ± 0.0\"))","v":"#"},{"$f":"IF(VLOOKUP($E$117,'Main Table'!$A$2:$BX$37,V133+1,FALSE)=\".\",\"#\",TEXT(100*VLOOKUP($E$117,'Main Table'!$A$2:$BX$37,V133+1,FALSE),\" ± 0.0\"))","v":" ± 0.6"},{"$f":"IF(VLOOKUP($E$117,'Main Table'!$A$2:$BX$37,W133+1,FALSE)=\".\",\"#\",TEXT(100*VLOOKUP($E$117,'Main Table'!$A$2:$BX$37,W133+1,FALSE),\" ± 0.0\"))","v":" ± 0.4"},null,39,45,42,36]
[]
[null,null,null,null,{"$f":"TEXT(VLOOKUP($E$117,'Main Table'!$A$2:$BX$37,T135,FALSE),\"#,##0\")","v":"171,400"},{"$f":"TEXT(VLOOKUP($E$117,'Main Table'!$A$2:$BX$37,U135,FALSE),\"#,##0\")","v":"4,400"},{"$f":"TEXT(VLOOKUP($E$117,'Main Table'!$A$2:$BX$37,V135,FALSE),\"#,##0\")","v":"71,500"},{"$f":"TEXT(VLOOKUP($E$117,'Main Table'!$A$2:$BX$37,W135,FALSE),\"#,##0\")","v":"175,800"},null,{"$f":"IF(ISBLANK(VLOOKUP($E$117,'Main Table'!$A$39:$BX$74,T135,FALSE))=TRUE,\"\",VLOOKUP($E$117,'Main Table'!$A$39:$BX$74,T135,FALSE))","v":""},{"$f":"IF(ISBLANK(VLOOKUP($E$117,'Main Table'!$A$39:$BX$74,U135,FALSE))=TRUE,\"\",VLOOKUP($E$117,'Main Table'!$A$39:$BX$74,U135,FALSE))","v":""},{"$f":"IF(ISBLANK(VLOOKUP($E$117,'Main Table'!$A$39:$BX$74,V135,FALSE))=TRUE,\"\",VLOOKUP($E$117,'Main Table'!$A$39:$BX$74,V135,FALSE))","v":""},{"$f":"IF(ISBLANK(VLOOKUP($E$117,'Main Table'!$A$39:$BX$74,W135,FALSE))=TRUE,\"\",VLOOKUP($E$117,'Main Table'!$A$39:$BX$74,W135,FALSE))","v":""},null,null,null,null,null,null,68,74,71,65]
[null,null,null,null,{"$f":"TEXT(100*VLOOKUP($E$117,'Main Table'!$A$2:$BX$37,T136,FALSE),\"0.0\")","v":"30.3"},{"$f":"TEXT(100*VLOOKUP($E$117,'Main Table'!$A$2:$BX$37,U136,FALSE),\"0.0\")","v":"0.8"},{"$f":"TEXT(100*VLOOKUP($E$117,'Main Table'!$A$2:$BX$37,V136,FALSE),\"0.0\")","v":"12.6"},{"$f":"TEXT(100*VLOOKUP($E$117,'Main Table'!$A$2:$BX$37,W136,FALSE),\"0.0\")","v":"31.1"},null,{"$f":"IF(ISBLANK(VLOOKUP($E$117,'Main Table'!$A$39:$BX$74,T136,FALSE))=TRUE,\"\",VLOOKUP($E$117,'Main Table'!$A$39:$BX$74,T136,FALSE))","v":""},{"$f":"IF(ISBLANK(VLOOKUP($E$117,'Main Table'!$A$39:$BX$74,U136,FALSE))=TRUE,\"\",VLOOKUP($E$117,'Main Table'!$A$39:$BX$74,U136,FALSE))","v":""},{"$f":"IF(ISBLANK(VLOOKUP($E$117,'Main Table'!$A$39:$BX$74,V136,FALSE))=TRUE,\"\",VLOOKUP($E$117,'Main Table'!$A$39:$BX$74,V136,FALSE))","v":""},{"$f":"IF(ISBLANK(VLOOKUP($E$117,'Main Table'!$A$39:$BX$74,W136,FALSE))=TRUE,\"\",VLOOKUP($E$117,'Main Table'!$A$39:$BX$74,W136,FALSE))","v":""},null,{"$f":"IF(VLOOKUP($E$117,'Main Table'!$A$2:$BX$37,T136+1,FALSE)=\".\",\"#\",TEXT(100*VLOOKUP($E$117,'Main Table'!$A$2:$BX$37,T136+1,FALSE),\" ± 0.0\"))","v":" ± 1.4"},{"$f":"IF(VLOOKUP($E$117,'Main Table'!$A$2:$BX$37,U136+1,FALSE)=\".\",\"#\",TEXT(100*VLOOKUP($E$117,'Main Table'!$A$2:$BX$37,U136+1,FALSE),\" ± 0.0\"))","v":" ± 0.3"},{"$f":"IF(VLOOKUP($E$117,'Main Table'!$A$2:$BX$37,V136+1,FALSE)=\".\",\"#\",TEXT(100*VLOOKUP($E$117,'Main Table'!$A$2:$BX$37,V136+1,FALSE),\" ± 0.0\"))","v":" ± 1.0"},{"$f":"IF(VLOOKUP($E$117,'Main Table'!$A$2:$BX$37,W136+1,FALSE)=\".\",\"#\",TEXT(100*VLOOKUP($E$117,'Main Table'!$A$2:$BX$37,W136+1,FALSE),\" ± 0.0\"))","v":" ± 1.4"},null,69,75,72,66]
[]
[]
[null,null,null,null,"Scotland Values",null,null,null,null,"Scotland SDC",null,null,null,null,"Scotland CI",null,null,null,null,"Scotland Look-Up Columns"]
[null,null,null,null,{"$f":"TEXT(VLOOKUP(\"Scotland\",'Main Table'!$A$2:$BX$37,T140,FALSE),\"#,##0\")","v":"565,500"},null,null,null,null,{"$f":"IF(ISBLANK(VLOOKUP(\"Scotland\",'Main Table'!$A$39:$BX$74,T140,FALSE))=TRUE,\"\",VLOOKUP(\"Scotland\",'Main Table'!$A$39:$BX$74,T140,FALSE))","v":""},null,null,null,null,null,null,null,null,null,2]
[null,null,null,null,{"$f":"\"16 to 24 year olds in \"&\"Scotland\"","v":"16 to 24 year olds in Scotland"},null,null,null,null,{"$f":"\"16 to 24 year olds in \"&\"Scotland\"","v":"16 to 24 year olds in Scotland"},null,null,null,null,{"$f":"\"16 to 24 year olds in \"&\"Scotland\"","v":"16 to 24 year olds in Scotland"},null,null,null,null,{"$f":"\"16 to 24 year olds in \"&\"Scotland\"","v":"16 to 24 year olds in Scotland"}]
[null,null,null,null,"FT Education","PT Education","Not in Education","All Education",null,"FT Education","PT Education","Not in Education","All Education",null,"FT Education","PT Education","Not in Education","All Education",null,"FT Education","PT Education","Not in Education","All Education"]
[null,null,null,null,{"$f":"TEXT(VLOOKUP(\"Scotland\",'Main Table'!$A$2:$BX$37,T143,FALSE),\"#,##0\")","v":"254,900"},{"$f":"TEXT(VLOOKUP(\"Scotland\",'Main Table'!$A$2:$BX$37,U143,FALSE),\"#,##0\")","v":"19,700"},{"$f":"TEXT(VLOOKUP(\"Scotland\",'Main Table'!$A$2:$BX$37,V143,FALSE),\"#,##0\")","v":"287,400"},{"$f":"TEXT(VLOOKUP(\"Scotland\",'Main Table'!$A$2:$BX$37,W143,FALSE),\"#,##0\")","v":"274,500"},null,{"$f":"IF(ISBLANK(VLOOKUP(\"Scotland\",'Main Table'!$A$39:$BX$74,T143,FALSE))=TRUE,\"\",VLOOKUP(\"Scotland\",'Main Table'!$A$39:$BX$74,T143,FALSE))","v":""},{"$f":"IF(ISBLANK(VLOOKUP(\"Scotland\",'Main Table'!$A$39:$BX$74,U143,FALSE))=TRUE,\"\",VLOOKUP(\"Scotland\",'Main Table'!$A$39:$BX$74,U143,FALSE))","v":""},{"$f":"IF(ISBLANK(VLOOKUP(\"Scotland\",'Main Table'!$A$39:$BX$74,V143,FALSE))=TRUE,\"\",VLOOKUP(\"Scotland\",'Main Table'!$A$39:$BX$74,V143,FALSE))","v":""},{"$f":"IF(ISBLANK(VLOOKUP(\"Scotland\",'Main Table'!$A$39:$BX$74,W143,FALSE))=TRUE,\"\",VLOOKUP(\"Scotland\",'Main Table'!$A$39:$BX$74,W143,FALSE))","v":""},null,null,null,null,null,null,{"$f":"T123","v":8},14,11,5]
[null,null,null,null,{"$f":"TEXT(100*VLOOKUP(\"Scotland\",'Main Table'!$A$2:$BX$37,T144,FALSE),\"0.0\")","v":"45.1"},{"$f":"TEXT(100*VLOOKUP(\"Scotland\",'Main Table'!$A$2:$BX$37,U144,FALSE),\"0.0\")","v":"3.5"},{"$f":"TEXT(100*VLOOKUP(\"Scotland\",'Main Table'!$A$2:$BX$37,V144,FALSE),\"0.0\")","v":"50.8"},{"$f":"TEXT(100*VLOOKUP(\"Scotland\",'Main Table'!$A$2:$BX$37,W144,FALSE),\"0.0\")","v":"48.5"},null,{"$f":"IF(ISBLANK(VLOOKUP(\"Scotland\",'Main Table'!$A$39:$BX$74,T144,FALSE))=TRUE,\"\",VLOOKUP(\"Scotland\",'Main Table'!$A$39:$BX$74,T144,FALSE))","v":""},{"$f":"IF(ISBLANK(VLOOKUP(\"Scotland\",'Main Table'!$A$39:$BX$74,U144,FALSE))=TRUE,\"\",VLOOKUP(\"Scotland\",'Main Table'!$A$39:$BX$74,U144,FALSE))","v":""},{"$f":"IF(ISBLANK(VLOOKUP(\"Scotland\",'Main Table'!$A$39:$BX$74,V144,FALSE))=TRUE,\"\",VLOOKUP(\"Scotland\",'Main Table'!$A$39:$BX$74,V144,FALSE))","v":""},{"$f":"IF(ISBLANK(VLOOKUP(\"Scotland\",'Main Table'!$A$39:$BX$74,W144,FALSE))=TRUE,\"\",VLOOKUP(\"Scotland\",'Main Table'!$A$39:$BX$74,W144,FALSE))","v":""},null,{"$f":"IF(VLOOKUP(\"Scotland\",'Main Table'!$A$2:$BX$37,T144+1,FALSE)=\".\",\"#\",TEXT(100*VLOOKUP(\"Scotland\",'Main Table'!$A$2:$BX$37,T144+1,FALSE),\" ± 0.0\"))","v":" ± 1.5"},{"$f":"IF(VLOOKUP(\"Scotland\",'Main Table'!$A$2:$BX$37,U144+1,FALSE)=\".\",\"#\",TEXT(100*VLOOKUP(\"Scotland\",'Main Table'!$A$2:$BX$37,U144+1,FALSE),\" ± 0.0\"))","v":" ± 0.6"},{"$f":"IF(VLOOKUP(\"Scotland\",'Main Table'!$A$2:$BX$37,V144+1,FALSE)=\".\",\"#\",TEXT(100*VLOOKUP(\"Scotland\",'Main Table'!$A$2:$BX$37,V144+1,FALSE),\" ± 0.0\"))","v":" ± 1.5"},{"$f":"IF(VLOOKUP(\"Scotland\",'Main Table'!$A$2:$BX$37,W144+1,FALSE)=\".\",\"#\",TEXT(100*VLOOKUP(\"Scotland\",'Main Table'!$A$2:$BX$37,W144+1,FALSE),\" ± 0.0\"))","v":" ± 1.5"},null,9,15,12,6]
[null,null,null,null,{"$f":"TEXT(VLOOKUP(\"Scotland\",'Main Table'!$A$2:$BX$37,T145,FALSE),\"#,##0\")","v":"83,500"},{"$f":"TEXT(VLOOKUP(\"Scotland\",'Main Table'!$A$2:$BX$37,U145,FALSE),\"#,##0\")","v":"15,200"},{"$f":"TEXT(VLOOKUP(\"Scotland\",'Main Table'!$A$2:$BX$37,V145,FALSE),\"#,##0\")","v":"215,900"},{"$f":"TEXT(VLOOKUP(\"Scotland\",'Main Table'!$A$2:$BX$37,W145,FALSE),\"#,##0\")","v":"98,700"},null,{"$f":"IF(ISBLANK(VLOOKUP(\"Scotland\",'Main Table'!$A$39:$BX$74,T145,FALSE))=TRUE,\"\",VLOOKUP(\"Scotland\",'Main Table'!$A$39:$BX$74,T145,FALSE))","v":""},{"$f":"IF(ISBLANK(VLOOKUP(\"Scotland\",'Main Table'!$A$39:$BX$74,U145,FALSE))=TRUE,\"\",VLOOKUP(\"Scotland\",'Main Table'!$A$39:$BX$74,U145,FALSE))","v":""},{"$f":"IF(ISBLANK(VLOOKUP(\"Scotland\",'Main Table'!$A$39:$BX$74,V145,FALSE))=TRUE,\"\",VLOOKUP(\"Scotland\",'Main Table'!$A$39:$BX$74,V145,FALSE))","v":""},{"$f":"IF(ISBLANK(VLOOKUP(\"Scotland\",'Main Table'!$A$39:$BX$74,W145,FALSE))=TRUE,\"\",VLOOKUP(\"Scotland\",'Main Table'!$A$39:$BX$74,W145,FALSE))","v":""},null,null,null,null,null,null,{"$f":"T125","v":23},{"$f":"U125","v":29},26,20]
[null,null,null,null,"in employment","in employment","in employment","in employment",null,"in employment","in employment","in employment","in employment",null,"in employment","in employment","in employment","in employment"]
[null,null,null,null,{"$f":"TEXT(100*VLOOKUP(\"Scotland\",'Main Table'!$A$2:$BX$37,T147,FALSE),\"0.0\")","v":"14.8"},{"$f":"TEXT(100*VLOOKUP(\"Scotland\",'Main Table'!$A$2:$BX$37,U147,FALSE),\"0.0\")","v":"2.7"},{"$f":"TEXT(100*VLOOKUP(\"Scotland\",'Main Table'!$A$2:$BX$37,V147,FALSE),\"0.0\")","v":"38.2"},{"$f":"TEXT(100*VLOOKUP(\"Scotland\",'Main Table'!$A$2:$BX$37,W147,FALSE),\"0.0\")","v":"17.5"},null,{"$f":"IF(ISBLANK(VLOOKUP(\"Scotland\",'Main Table'!$A$39:$BX$74,T147,FALSE))=TRUE,\"\",VLOOKUP(\"Scotland\",'Main Table'!$A$39:$BX$74,T147,FALSE))","v":""},{"$f":"IF(ISBLANK(VLOOKUP(\"Scotland\",'Main Table'!$A$39:$BX$74,U147,FALSE))=TRUE,\"\",VLOOKUP(\"Scotland\",'Main Table'!$A$39:$BX$74,U147,FALSE))","v":""},{"$f":"IF(ISBLANK(VLOOKUP(\"Scotland\",'Main Table'!$A$39:$BX$74,V147,FALSE))=TRUE,\"\",VLOOKUP(\"Scotland\",'Main Table'!$A$39:$BX$74,V147,FALSE))","v":""},{"$f":"IF(ISBLANK(VLOOKUP(\"Scotland\",'Main Table'!$A$39:$BX$74,W147,FALSE))=TRUE,\"\",VLOOKUP(\"Scotland\",'Main Table'!$A$39:$BX$74,W147,FALSE))","v":""},null,{"$f":"IF(VLOOKUP(\"Scotland\",'Main Table'!$A$2:$BX$37,T147+1,FALSE)=\".\",\"#\",TEXT(100*VLOOKUP(\"Scotland\",'Main Table'!$A$2:$BX$37,T147+1,FALSE),\" ± 0.0\"))","v":" ± 1.1"},{"$f":"IF(VLOOKUP(\"Scotland\",'Main Table'!$A$2:$BX$37,U147+1,FALSE)=\".\",\"#\",TEXT(100*VLOOKUP(\"Scotland\",'Main Table'!$A$2:$BX$37,U147+1,FALSE),\" ± 0.0\"))","v":" ± 0.5"},{"$f":"IF(VLOOKUP(\"Scotland\",'Main Table'!$A$2:$BX$37,V147+1,FALSE)=\".\",\"#\",TEXT(100*VLOOKUP(\"Scotland\",'Main Table'!$A$2:$BX$37,V147+1,FALSE),\" ± 0.0\"))","v":" ± 1.5"},{"$f":"IF(VLOOKUP(\"Scotland\",'Main Table'!$A$2:$BX$37,W147+1,FALSE)=\".\",\"#\",TEXT(100*VLOOKUP(\"Scotland\",'Main Table'!$A$2:$BX$37,W147+1,FALSE),\" ± 0.0\"))","v":" ± 1.1"},null,{"$f":"T127","v":24},30,27,21]
[null,null,null,null,{"$f":"TEXT(VLOOKUP(\"Scotland\",'Main Table'!$A$2:$BX$37,T148,FALSE),\"#,##0\")","v":"162,000"},{"$f":"TEXT(VLOOKUP(\"Scotland\",'Main Table'!$A$2:$BX$37,U148,FALSE),\"#,##0\")","v":"3,800"},{"$f":"TEXT(VLOOKUP(\"Scotland\",'Main Table'!$A$2:$BX$37,V148,FALSE),\"#,##0\")","v":"50,700"},{"$f":"TEXT(VLOOKUP(\"Scotland\",'Main Table'!$A$2:$BX$37,W148,FALSE),\"#,##0\")","v":"165,800"},null,{"$f":"IF(ISBLANK(VLOOKUP(\"Scotland\",'Main Table'!$A$39:$BX$74,T148,FALSE))=TRUE,\"\",VLOOKUP(\"Scotland\",'Main Table'!$A$39:$BX$74,T148,FALSE))","v":""},{"$f":"IF(ISBLANK(VLOOKUP(\"Scotland\",'Main Table'!$A$39:$BX$74,U148,FALSE))=TRUE,\"\",VLOOKUP(\"Scotland\",'Main Table'!$A$39:$BX$74,U148,FALSE))","v":""},{"$f":"IF(ISBLANK(VLOOKUP(\"Scotland\",'Main Table'!$A$39:$BX$74,V148,FALSE))=TRUE,\"\",VLOOKUP(\"Scotland\",'Main Table'!$A$39:$BX$74,V148,FALSE))","v":""},{"$f":"IF(ISBLANK(VLOOKUP(\"Scotland\",'Main Table'!$A$39:$BX$74,W148,FALSE))=TRUE,\"\",VLOOKUP(\"Scotland\",'Main Table'!$A$39:$BX$74,W148,FALSE))","v":""},null,null,null,null,null,null,{"$f":"T128","v":53},59,56,50]
[null,null,null,null,"inactive","inactive","inactive","inactive",null,"inactive","inactive","inactive","inactive",null,"inactive","inactive","inactive","inactive"]
[null,null,null,null,{"$f":"TEXT(100*VLOOKUP(\"Scotland\",'Main Table'!$A$2:$BX$37,T150,FALSE),\"0.0\")","v":"28.7"},{"$f":"TEXT(100*VLOOKUP(\"Scotland\",'Main Table'!$A$2:$BX$37,U150,FALSE),\"0.0\")","v":"0.7"},{"$f":"TEXT(100*VLOOKUP(\"Scotland\",'Main Table'!$A$2:$BX$37,V150,FALSE),\"0.0\")","v":"9.0"},{"$f":"TEXT(100*VLOOKUP(\"Scotland\",'Main Table'!$A$2:$BX$37,W150,FALSE),\"0.0\")","v":"29.3"},null,{"$f":"IF(ISBLANK(VLOOKUP(\"Scotland\",'Main Table'!$A$39:$BX$74,T150,FALSE))=TRUE,\"\",VLOOKUP(\"Scotland\",'Main Table'!$A$39:$BX$74,T150,FALSE))","v":""},{"$f":"IF(ISBLANK(VLOOKUP(\"Scotland\",'Main Table'!$A$39:$BX$74,U150,FALSE))=TRUE,\"\",VLOOKUP(\"Scotland\",'Main Table'!$A$39:$BX$74,U150,FALSE))","v":""},{"$f":"IF(ISBLANK(VLOOKUP(\"Scotland\",'Main Table'!$A$39:$BX$74,V150,FALSE))=TRUE,\"\",VLOOKUP(\"Scotland\",'Main Table'!$A$39:$BX$74,V150,FALSE))","v":""},{"$f":"IF(ISBLANK(VLOOKUP(\"Scotland\",'Main Table'!$A$39:$BX$74,W150,FALSE))=TRUE,\"\",VLOOKUP(\"Scotland\",'Main Table'!$A$39:$BX$74,W150,FALSE))","v":""},null,{"$f":"IF(VLOOKUP(\"Scotland\",'Main Table'!$A$2:$BX$37,T150+1,FALSE)=\".\",\"#\",TEXT(100*VLOOKUP(\"Scotland\",'Main Table'!$A$2:$BX$37,T150+1,FALSE),\" ± 0.0\"))","v":" ± 1.4"},{"$f":"IF(VLOOKUP(\"Scotland\",'Main Table'!$A$2:$BX$37,U150+1,FALSE)=\".\",\"#\",TEXT(100*VLOOKUP(\"Scotland\",'Main Table'!$A$2:$BX$37,U150+1,FALSE),\" ± 0.0\"))","v":" ± 0.2"},{"$f":"IF(VLOOKUP(\"Scotland\",'Main Table'!$A$2:$BX$37,V150+1,FALSE)=\".\",\"#\",TEXT(100*VLOOKUP(\"Scotland\",'Main Table'!$A$2:$BX$37,V150+1,FALSE),\" ± 0.0\"))","v":" ± 0.9"},{"$f":"IF(VLOOKUP(\"Scotland\",'Main Table'!$A$2:$BX$37,W150+1,FALSE)=\".\",\"#\",TEXT(100*VLOOKUP(\"Scotland\",'Main Table'!$A$2:$BX$37,W150+1,FALSE),\" ± 0.0\"))","v":" ± 1.4"},null,{"$f":"T130","v":54},60,57,51]
[null,null,null,null,{"$f":"TEXT(VLOOKUP(\"Scotland\",'Main Table'!$A$2:$BX$37,T151,FALSE),\"#,##0\")","v":"9,400"},{"$f":"TEXT(VLOOKUP(\"Scotland\",'Main Table'!$A$2:$BX$37,U151,FALSE),\"#,##0\")","v":"700"},{"$f":"TEXT(VLOOKUP(\"Scotland\",'Main Table'!$A$2:$BX$37,V151,FALSE),\"#,##0\")","v":"20,800"},{"$f":"TEXT(VLOOKUP(\"Scotland\",'Main Table'!$A$2:$BX$37,W151,FALSE),\"#,##0\")","v":"10,000"},null,{"$f":"IF(ISBLANK(VLOOKUP(\"Scotland\",'Main Table'!$A$39:$BX$74,T151,FALSE))=TRUE,\"\",VLOOKUP(\"Scotland\",'Main Table'!$A$39:$BX$74,T151,FALSE))","v":""},{"$f":"IF(ISBLANK(VLOOKUP(\"Scotland\",'Main Table'!$A$39:$BX$74,U151,FALSE))=TRUE,\"\",VLOOKUP(\"Scotland\",'Main Table'!$A$39:$BX$74,U151,FALSE))","v":"*"},{"$f":"IF(ISBLANK(VLOOKUP(\"Scotland\",'Main Table'!$A$39:$BX$74,V151,FALSE))=TRUE,\"\",VLOOKUP(\"Scotland\",'Main Table'!$A$39:$BX$74,V151,FALSE))","v":""},{"$f":"IF(ISBLANK(VLOOKUP(\"Scotland\",'Main Table'!$A$39:$BX$74,W151,FALSE))=TRUE,\"\",VLOOKUP(\"Scotland\",'Main Table'!$A$39:$BX$74,W151,FALSE))","v":""},null,null,null,null,null,null,{"$f":"T131","v":38},44,41,35]
[null,null,null,null,"unemployed","unemployed","unemployed","unemployed",null,"unemployed","unemployed","unemployed","unemployed",null,"unemployed","unemployed","unemployed","unemployed"]
[null,null,null,null,{"$f":"TEXT(100*VLOOKUP(\"Scotland\",'Main Table'!$A$2:$BX$37,T153,FALSE),\"0.0\")","v":"1.7"},{"$f":"TEXT(100*VLOOKUP(\"Scotland\",'Main Table'!$A$2:$BX$37,U153,FALSE),\"0.0\")","v":"0.1"},{"$f":"TEXT(100*VLOOKUP(\"Scotland\",'Main Table'!$A$2:$BX$37,V153,FALSE),\"0.0\")","v":"3.7"},{"$f":"TEXT(100*VLOOKUP(\"Scotland\",'Main Table'!$A$2:$BX$37,W153,FALSE),\"0.0\")","v":"1.8"},null,{"$f":"IF(ISBLANK(VLOOKUP(\"Scotland\",'Main Table'!$A$39:$BX$74,T153,FALSE))=TRUE,\"\",VLOOKUP(\"Scotland\",'Main Table'!$A$39:$BX$74,T153,FALSE))","v":""},{"$f":"IF(ISBLANK(VLOOKUP(\"Scotland\",'Main Table'!$A$39:$BX$74,U153,FALSE))=TRUE,\"\",VLOOKUP(\"Scotland\",'Main Table'!$A$39:$BX$74,U153,FALSE))","v":"*"},{"$f":"IF(ISBLANK(VLOOKUP(\"Scotland\",'Main Table'!$A$39:$BX$74,V153,FALSE))=TRUE,\"\",VLOOKUP(\"Scotland\",'Main Table'!$A$39:$BX$74,V153,FALSE))","v":""},{"$f":"IF(ISBLANK(VLOOKUP(\"Scotland\",'Main Table'!$A$39:$BX$74,W153,FALSE))=TRUE,\"\",VLOOKUP(\"Scotland\",'Main Table'!$A$39:$BX$74,W153,FALSE))","v":""},null,{"$f":"IF(VLOOKUP(\"Scotland\",'Main Table'!$A$2:$BX$37,T153+1,FALSE)=\".\",\"#\",TEXT(100*VLOOKUP(\"Scotland\",'Main Table'!$A$2:$BX$37,T153+1,FALSE),\" ± 0.0\"))","v":" ± 0.4"},{"$f":"IF(VLOOKUP(\"Scotland\",'Main Table'!$A$2:$BX$37,U153+1,FALSE)=\".\",\"#\",TEXT(100*VLOOKUP(\"Scotland\",'Main Table'!$A$2:$BX$37,U153+1,FALSE),\" ± 0.0\"))","v":"#"},{"$f":"IF(VLOOKUP(\"Scotland\",'Main Table'!$A$2:$BX$37,V153+1,FALSE)=\".\",\"#\",TEXT(100*VLOOKUP(\"Scotland\",'Main Table'!$A$2:$BX$37,V153+1,FALSE),\" ± 0.0\"))","v":" ± 0.6"},{"$f":"IF(VLOOKUP(\"Scotland\",'Main Table'!$A$2:$BX$37,W153+1,FALSE)=\".\",\"#\",TEXT(100*VLOOKUP(\"Scotland\",'Main Table'!$A$2:$BX$37,W153+1,FALSE),\" ± 0.0\"))","v":" ± 0.4"},null,{"$f":"T133","v":39},45,42,36]
[]
[null,null,null,null,{"$f":"TEXT(VLOOKUP(\"Scotland\",'Main Table'!$A$2:$BX$37,T155,FALSE),\"#,##0\")","v":"171,400"},{"$f":"TEXT(VLOOKUP(\"Scotland\",'Main Table'!$A$2:$BX$37,U155,FALSE),\"#,##0\")","v":"4,400"},{"$f":"TEXT(VLOOKUP(\"Scotland\",'Main Table'!$A$2:$BX$37,V155,FALSE),\"#,##0\")","v":"71,500"},{"$f":"TEXT(VLOOKUP(\"Scotland\",'Main Table'!$A$2:$BX$37,W155,FALSE),\"#,##0\")","v":"175,800"},null,{"$f":"IF(ISBLANK(VLOOKUP(\"Scotland\",'Main Table'!$A$39:$BX$74,T155,FALSE))=TRUE,\"\",VLOOKUP(\"Scotland\",'Main Table'!$A$39:$BX$74,T155,FALSE))","v":""},{"$f":"IF(ISBLANK(VLOOKUP(\"Scotland\",'Main Table'!$A$39:$BX$74,U155,FALSE))=TRUE,\"\",VLOOKUP(\"Scotland\",'Main Table'!$A$39:$BX$74,U155,FALSE))","v":""},{"$f":"IF(ISBLANK(VLOOKUP(\"Scotland\",'Main Table'!$A$39:$BX$74,V155,FALSE))=TRUE,\"\",VLOOKUP(\"Scotland\",'Main Table'!$A$39:$BX$74,V155,FALSE))","v":""},{"$f":"IF(ISBLANK(VLOOKUP(\"Scotland\",'Main Table'!$A$39:$BX$74,W155,FALSE))=TRUE,\"\",VLOOKUP(\"Scotland\",'Main Table'!$A$39:$BX$74,W155,FALSE))","v":""},null,null,null,null,null,null,{"$f":"T135","v":68},74,71,65]
[null,null,null,null,{"$f":"TEXT(100*VLOOKUP(\"Scotland\",'Main Table'!$A$2:$BX$37,T156,FALSE),\"0.0\")","v":"30.3"},{"$f":"TEXT(100*VLOOKUP(\"Scotland\",'Main Table'!$A$2:$BX$37,U156,FALSE),\"0.0\")","v":"0.8"},{"$f":"TEXT(100*VLOOKUP(\"Scotland\",'Main Table'!$A$2:$BX$37,V156,FALSE),\"0.0\")","v":"12.6"},{"$f":"TEXT(100*VLOOKUP(\"Scotland\",'Main Table'!$A$2:$BX$37,W156,FALSE),\"0.0\")","v":"31.1"},null,{"$f":"IF(ISBLANK(VLOOKUP(\"Scotland\",'Main Table'!$A$39:$BX$74,T156,FALSE))=TRUE,\"\",VLOOKUP(\"Scotland\",'Main Table'!$A$39:$BX$74,T156,FALSE))","v":""},{"$f":"IF(ISBLANK(VLOOKUP(\"Scotland\",'Main Table'!$A$39:$BX$74,U156,FALSE))=TRUE,\"\",VLOOKUP(\"Scotland\",'Main Table'!$A$39:$BX$74,U156,FALSE))","v":""},{"$f":"IF(ISBLANK(VLOOKUP(\"Scotland\",'Main Table'!$A$39:$BX$74,V156,FALSE))=TRUE,\"\",VLOOKUP(\"Scotland\",'Main Table'!$A$39:$BX$74,V156,FALSE))","v":""},{"$f":"IF(ISBLANK(VLOOKUP(\"Scotland\",'Main Table'!$A$39:$BX$74,W156,FALSE))=TRUE,\"\",VLOOKUP(\"Scotland\",'Main Table'!$A$39:$BX$74,W156,FALSE))","v":""},null,{"$f":"IF(VLOOKUP(\"Scotland\",'Main Table'!$A$2:$BX$37,T156+1,FALSE)=\".\",\"#\",TEXT(100*VLOOKUP(\"Scotland\",'Main Table'!$A$2:$BX$37,T156+1,FALSE),\" ± 0.0\"))","v":" ± 1.4"},{"$f":"IF(VLOOKUP(\"Scotland\",'Main Table'!$A$2:$BX$37,U156+1,FALSE)=\".\",\"#\",TEXT(100*VLOOKUP(\"Scotland\",'Main Table'!$A$2:$BX$37,U156+1,FALSE),\" ± 0.0\"))","v":" ± 0.3"},{"$f":"IF(VLOOKUP(\"Scotland\",'Main Table'!$A$2:$BX$37,V156+1,FALSE)=\".\",\"#\",TEXT(100*VLOOKUP(\"Scotland\",'Main Table'!$A$2:$BX$37,V156+1,FALSE),\" ± 0.0\"))","v":" ± 1.0"},{"$f":"IF(VLOOKUP(\"Scotland\",'Main Table'!$A$2:$BX$37,W156+1,FALSE)=\".\",\"#\",TEXT(100*VLOOKUP(\"Scotland\",'Main Table'!$A$2:$BX$37,W156+1,FALSE),\" ± 0.0\"))","v":" ± 1.4"},null,69,75,72,66]
[]
[]
[null,null,null,null,{"$f":"IF(J120=\"***\", \"\", E120&J120)","v":"565,500"},null,null,null,null,null,"All",null,null,"employment",null,null,"unemployed",null,null,"inactive",null,null,"Unemployed & Inactive"]
[null,null,null,null,{"$f":"IF(J120=\"***\",\"\",\"16 to 24 year olds in \"&$E$117)","v":"16 to 24 year olds in Scotland"},null,null,null,{"$f":"E117","v":"Scotland"},null,"Level","Prop","CI","Level","Prop","CI","Level","Prop","CI","Level","Prop","CI","Level","Prop","CI"]
[null,null,null,null,{"$f":"IF(J123=\"***\",IF(M123=\"***\",\"\",\"In Education\"),\"FT Education\")","v":"FT Education"},{"$f":"IF(K123=\"***\",\"\",\"PT Education\")","v":"PT Education"},"Not in Education",null,null,{"$f":"H122","v":"All Education"},{"$f":"H123","v":"274,500"},{"$f":"H124","v":"48.5"},{"$f":"R124","v":" ± 1.5"},{"$f":"H125","v":"98,700"},{"$f":"H127","v":"17.5"},{"$f":"R127","v":" ± 1.1"},{"$f":"H131","v":"10,000"},{"$f":"H133","v":"1.8"},{"$f":"R133","v":" ± 0.4"},{"$f":"H128","v":"165,800"},{"$f":"H130","v":"29.3"},{"$f":"R130","v":" ± 1.4"},{"$f":"H135","v":"175,800"},{"$f":"H136","v":"31.1"},{"$f":"R136","v":" ± 1.4"}]
[null,null,null,null,{"$f":"IF(J123=\"***\", IF(M123=\"***\",\"\",H123&M123), E123&J123)","v":"254,900"},{"$f":"IF(K123=\"***\", \"\",F123&K123)","v":"19,700"},{"$f":"IF(L123=\"***\", \"\",G123&L123)","v":"287,400"},null,null,{"$f":"E122","v":"FT Education"},{"$f":"E123","v":"254,900"},{"$f":"E124","v":"45.1"},{"$f":"O124","v":" ± 1.5"},{"$f":"E125","v":"83,500"},{"$f":"E127","v":"14.8"},{"$f":"O127","v":" ± 1.1"},{"$f":"E131","v":"9,400"},{"$f":"E133","v":"1.7"},{"$f":"O133","v":" ± 0.4"},{"$f":"E128","v":"162,000"},{"$f":"E130","v":"28.7"},{"$f":"O130","v":" ± 1.4"},{"$f":"E135","v":"171,400"},{"$f":"E136","v":"30.3"},{"$f":"O136","v":" ± 1.4"}]
[null,null,null,null,{"$f":"IF(J124=\"***\",IF(M124=\"***\",\"\",\"(\"&H124&M124&\" per cent)\"),\"(\"&E124&J124&\" per cent)\")","v":"(45.1 per cent)"},{"$f":"IF(K124=\"***\",\"\",\"(\"&F124&K124&\" per cent)\")","v":"(3.5 per cent)"},{"$f":"IF(L124=\"***\",\"\",\"(\"&G124&L124&\" per cent)\")","v":"(50.8 per cent)"},null,null,{"$f":"F122","v":"PT Education"},{"$f":"F123","v":"19,700"},{"$f":"F124","v":"3.5"},{"$f":"P124","v":" ± 0.6"},{"$f":"F125","v":"15,200"},{"$f":"F127","v":"2.7"},{"$f":"P127","v":" ± 0.5"},{"$f":"F131","v":"700"},{"$f":"F133","v":"0.1"},{"$f":"P133","v":"#"},{"$f":"F128","v":"3,800"},{"$f":"F130","v":"0.7"},{"$f":"P130","v":" ± 0.2"},{"$f":"F135","v":"4,400"},{"$f":"F136","v":"0.8"},{"$f":"P136","v":" ± 0.3"}]
[null,null,null,null,{"$f":"IF(J125=\"***\", IF(M125=\"***\",\"\",H125&M125), E125&J125)","v":"83,500"},{"$f":"IF(K125=\"***\", \"\", F125&K125)","v":"15,200"},{"$f":"IF(L125=\"***\", \"\", G125&L125)","v":"215,900"},null,null,{"$f":"G122","v":"Not in Education"},{"$f":"G123","v":"287,400"},{"$f":"G124","v":"50.8"},{"$f":"Q124","v":" ± 1.5"},{"$f":"G125","v":"215,900"},{"$f":"G127","v":"38.2"},{"$f":"Q127","v":" ± 1.5"},{"$f":"G131","v":"20,800"},{"$f":"G133","v":"3.7"},{"$f":"Q133","v":" ± 0.6"},{"$f":"G128","v":"50,700"},{"$f":"G130","v":"9.0"},{"$f":"Q130","v":" ± 0.9"},{"$f":"G135","v":"71,500"},{"$f":"G136","v":"12.6"},{"$f":"Q136","v":" ± 1.0"}]
[null,null,null,null,{"$f":"IF(AND(J125=\"***\",M125=\"***\"), \"\", \"in employment\")","v":"in employment"},{"$f":"IF(K125=\"***\", \"\", \"in employment\")","v":"in employment"},{"$f":"IF(L125=\"***\", \"\", \"in employment\")","v":"in employment"},null,null,"All",{"$f":"TEXT(VLOOKUP($E$117,'Main Table'!$A$2:$BX$37,K166,FALSE),\"#,##0\")","v":"565,500"}]
[null,null,null,null,{"$f":"IF(J127=\"***\",IF(M127=\"***\",\"***\",\"(\"&H127&M127&\" per cent)\"),\"(\"&E127&J127&\" per cent)\")","v":"(14.8 per cent)"},{"$f":"IF(K127=\"***\",\"\",\"(\"&F127&K127&\" per cent)\")","v":"(2.7 per cent)"},{"$f":"IF(L127=\"***\",\"\",\"(\"&G127&L127&\" per cent)\")","v":"(38.2 per cent)"},null,null,null,2,3,4,17,18,19,32,33,34,47,48,49,62,63,64]
[null,null,null,null,{"$f":"IF(J128=\"***\", IF(J135=\"***\",IF(M128=\"***\", IF(M135=\"***\",\"\",H135&M135), H128&M128),E135&J135), E128&J128)","v":"162,000"},{"$f":"IF(K128=\"***\", IF(K135=\"***\",\"\",F135&K135), F128&K128)","v":"3,800"},{"$f":"IF(L128=\"***\", IF(L135=\"***\",\"\",G135&L135), G128&L128)","v":"50,700"},null,"Scotland",{"$f":"J161","v":"All Education"},{"$f":"H143","v":"274,500"},{"$f":"H144","v":"48.5"},{"$f":"R144","v":" ± 1.5"},{"$f":"H145","v":"98,700"},{"$f":"H147","v":"17.5"},{"$f":"R147","v":" ± 1.1"},{"$f":"H151","v":"10,000"},{"$f":"H153","v":"1.8"},{"$f":"R153","v":" ± 0.4"},{"$f":"H148","v":"165,800"},{"$f":"H150","v":"29.3"},{"$f":"R150","v":" ± 1.4"},{"$f":"H155","v":"175,800"},{"$f":"H156","v":"31.1"},{"$f":"R156","v":" ± 1.4"}]
[null,null,null,null,{"$f":"IF(J128=\"***\", IF(J135=\"***\",IF(M128=\"***\", IF(M135=\"***\",\"\",\"inactive & unemployed\"), \"inactive\"),\"inactive & unemployed\"), \"inactive\")","v":"inactive"},{"$f":"IF(K128=\"***\", IF(K135=\"***\",\"\",\"inactive & unemployed\"), \"inactive\")","v":"inactive"},{"$f":"IF(L128=\"***\", IF(L135=\"***\",\"\",\"inactive & unemployed\"), \"inactive\")","v":"inactive"},null,null,{"$f":"J162","v":"FT Education"},{"$f":"E143","v":"254,900"},{"$f":"E144","v":"45.1"},{"$f":"O144","v":" ± 1.5"},{"$f":"E145","v":"83,500"},{"$f":"E147","v":"14.8"},{"$f":"O147","v":" ± 1.1"},{"$f":"E151","v":"9,400"},{"$f":"E153","v":"1.7"},{"$f":"O153","v":" ± 0.4"},{"$f":"E148","v":"162,000"},{"$f":"E150","v":"28.7"},{"$f":"O150","v":" ± 1.4"},{"$f":"E155","v":"171,400"},{"$f":"E156","v":"30.3"},{"$f":"O156","v":" ± 1.4"}]
[null,null,null,null,{"$f":"IF(J130=\"***\",IF(J136=\"***\",IF(M130=\"***\",IF(M136=\"***\",\"\",\"(\"&H136&M136&\" per cent)\"),\"(\"&H130&M130&\" per cent)\"),\"(\"&E136&J136&\" per cent)\"),\"(\"&E130&J130&\" per cent)\")","v":"(28.7 per cent)"},{"$f":"IF(K130=\"***\",IF(K136=\"***\",\"\",\"(\"&F136&K136&\" per cent)\"),\"(\"&F130&K130&\" per cent)\")","v":"(0.7 per cent)"},{"$f":"IF(L130=\"***\",IF(L136=\"***\",\"\",\"(\"&G136&L136&\" per cent)\"),\"(\"&G130&L130&\" per cent)\")","v":"(9.0 per cent)"},null,null,{"$f":"J163","v":"PT Education"},{"$f":"F143","v":"19,700"},{"$f":"F144","v":"3.5"},{"$f":"P144","v":" ± 0.6"},{"$f":"F145","v":"15,200"},{"$f":"F147","v":"2.7"},{"$f":"P147","v":" ± 0.5"},{"$f":"F151","v":"700"},{"$f":"F153","v":"0.1"},{"$f":"P153","v":"#"},{"$f":"F148","v":"3,800"},{"$f":"F150","v":"0.7"},{"$f":"P150","v":" ± 0.2"},{"$f":"F155","v":"4,400"},{"$f":"F156","v":"0.8"},{"$f":"P156","v":" ± 0.3"}]
[null,null,null,null,{"$f":"IF(J131=\"***\", IF(J135=\"***\",IF(M131=\"***\", \"\", H131&M131),\"\"), E131&J131)","v":"9,400"},{"$f":"IF(K131=\"***\", \"\", F131&K131)","v":"700*"},{"$f":"IF(L131=\"***\", \"\", G131&L131)","v":"20,800"},null,null,{"$f":"J164","v":"Not in Education"},{"$f":"G143","v":"287,400"},{"$f":"G144","v":"50.8"},{"$f":"Q144","v":" ± 1.5"},{"$f":"G145","v":"215,900"},{"$f":"G147","v":"38.2"},{"$f":"Q147","v":" ± 1.5"},{"$f":"G151","v":"20,800"},{"$f":"G153","v":"3.7"},{"$f":"Q153","v":" ± 0.6"},{"$f":"G148","v":"50,700"},{"$f":"G150","v":"9.0"},{"$f":"Q150","v":" ± 0.9"},{"$f":"G155","v":"71,500"},{"$f":"G156","v":"12.6"},{"$f":"Q156","v":" ± 1.0"}]
[null,null,null,null,{"$f":"IF(J131=\"***\", IF(J135=\"***\",IF(M131=\"***\", \"\", \"unemployed\"),\"\"), \"unemployed\")","v":"unemployed"},{"$f":"IF(K131=\"***\",\"\",\"unemployed\")","v":"unemployed"},{"$f":"IF(L131=\"***\",\"\",\"unemployed\")","v":"unemployed"},null,null,{"$f":"J165","v":"All"},{"$f":"TEXT(VLOOKUP(\"Scotland\",'Main Table'!$A$2:$BX$37,K166,FALSE),\"#,##0\")","v":"565,500"}]
[null,null,null,null,{"$f":"IF(J133=\"***\",IF(J136=\"***\",IF(M133=\"***\",\"\",\"(\"&H133&M133&\" per cent)\"),\"\"),\"(\"&E133&J133&\" per cent)\")","v":"(1.7 per cent)"},{"$f":"IF(K133=\"***\",\"\",\"(\"&F133&K133&\" per cent)\")","v":"(0.1* per cent)"},{"$f":"IF(L133=\"***\",\"\",\"(\"&G133&L133&\" per cent)\")","v":"(3.7 per cent)"}]
[null,null,null,null,null,null,null,null,null,null,"All",null,null,"employment",null,null,"unemployed",null,null,"inactive",null,null,"Unemployed & Inactive"]
[null,null,null,null,null,null,null,null,{"$f":"I160","v":"Scotland"},null,"Level","Prop","CI","Level","Prop","CI","Level","Prop","CI","Level","Prop","CI","Level","Prop","CI"]
[null,null,null,null,null,null,null,null,null,{"$f":"J161","v":"All Education"},{"$f":"IF(OR(K176<>\"***\",K177<>\"***\"),\"***\",M123)","v":"***"},{"$f":"IF(OR(L176<>\"***\",L177<>\"***\"),\"***\",M124)","v":"***"},{"$f":"L175","v":"***"},{"$f":"IF(OR(N176<>\"***\",N177<>\"***\"),\"***\",M125)","v":"***"},{"$f":"IF(OR(O176<>\"***\",O177<>\"***\"),\"***\",M127)","v":"***"},{"$f":"O175","v":"***"},{"$f":"IF(OR(Q176<>\"***\",Q177<>\"***\",W176<>\"***\",W177<>\"***\"),\"***\",M131)","v":"***"},{"$f":"IF(OR(R176<>\"***\",R177<>\"***\",X176<>\"***\",X177<>\"***\"),\"***\",M133)","v":"***"},{"$f":"R175","v":"***"},{"$f":"IF(OR(T176<>\"***\",T177<>\"***\",W176<>\"***\",W177<>\"***\"),\"***\",M128)","v":"***"},{"$f":"IF(OR(U176<>\"***\",U177<>\"***\",X176<>\"***\",X177<>\"***\"),\"***\",M130)","v":"***"},{"$f":"U175","v":"***"},{"$f":"IF(OR(Q175<>\"***\",T175<>\"***\",Q176<>\"***\",T176<>\"***\",Q177<>\"***\",T177<>\"***\",W176<>\"***\",W177<>\"***\"),\"***\",M135)","v":"***"},{"$f":"IF(OR(R175<>\"***\",U175<>\"***\",R176<>\"***\",U176<>\"***\",R177<>\"***\",U177<>\"***\",X176<>\"***\",X177<>\"***\"),\"***\",M136)","v":"***"},{"$f":"X175","v":"***"}]
[null,null,null,null,null,null,null,null,null,{"$f":"J162","v":"FT Education"},{"$f":"J123","v":""},{"$f":"J124","v":""},{"$f":"L176","v":""},{"$f":"J125","v":""},{"$f":"J127","v":""},{"$f":"O176","v":""},{"$f":"J131","v":""},{"$f":"J133","v":""},{"$f":"R176","v":""},{"$f":"J128","v":""},{"$f":"J130","v":""},{"$f":"U176","v":""},{"$f":"IF(OR(Q176<>\"***\",T176<>\"***\"),\"***\",J135)","v":"***"},{"$f":"IF(OR(R176<>\"***\",U176<>\"***\"),\"***\",J136)","v":"***"},{"$f":"X176","v":"***"}]
[null,null,null,null,null,null,null,null,null,{"$f":"J163","v":"PT Education"},{"$f":"K123","v":""},{"$f":"K124","v":""},{"$f":"L177","v":""},{"$f":"K125","v":""},{"$f":"K127","v":""},{"$f":"O177","v":""},{"$f":"K131","v":"*"},{"$f":"K133","v":"*"},{"$f":"R177","v":"*"},{"$f":"K128","v":""},{"$f":"K130","v":""},{"$f":"U177","v":""},{"$f":"IF(OR(Q177<>\"***\",T177<>\"***\"),\"***\",K135)","v":"***"},{"$f":"IF(OR(R177<>\"***\",U177<>\"***\"),\"***\",K136)","v":"***"},{"$f":"X177","v":"***"}]
[null,null,null,null,null,null,null,null,null,{"$f":"J164","v":"Not in Education"},{"$f":"L123","v":""},{"$f":"L124","v":""},{"$f":"L178","v":""},{"$f":"L125","v":""},{"$f":"L127","v":""},{"$f":"O178","v":""},{"$f":"L131","v":""},{"$f":"L133","v":""},{"$f":"R178","v":""},{"$f":"L128","v":""},{"$f":"L130","v":""},{"$f":"U178","v":""},{"$f":"IF(Q178<>\"***\",\"***\",L135)","v":"***"},{"$f":"IF(R178<>\"***\",\"***\",L136)","v":"***"},{"$f":"X178","v":"***"}]
[null,null,null,null,null,null,null,null,null,{"$f":"J165","v":"All"},{"$f":"IF(ISBLANK(VLOOKUP($E$117,'Main Table'!$A$39:$BX$74,K180,FALSE))=TRUE,\"\",VLOOKUP($E$117,'Main Table'!$A$39:$BX$74,K180,FALSE))","v":""}]
[null,null,null,null,null,null,null,null,null,null,2,3,4,17,18,19,32,33,34,47,48,49,62,63,64]
[null,null,null,null,null,null,null,null,"Scotland",{"$f":"J175","v":"All Education"},{"$f":"IF(K175=\"***\",\"***\",M143)","v":"***"},{"$f":"IF(L175=\"***\",\"***\",M144)","v":"***"},{"$f":"L181","v":"***"},{"$f":"IF(N175=\"***\",\"***\",M145)","v":"***"},{"$f":"IF(O175=\"***\",\"***\",M147)","v":"***"},{"$f":"O181","v":"***"},{"$f":"IF(Q175=\"***\",\"***\",M151)","v":"***"},{"$f":"IF(R175=\"***\",\"***\",M153)","v":"***"},{"$f":"R181","v":"***"},{"$f":"IF(T175=\"***\",\"***\",M148)","v":"***"},{"$f":"IF(U175=\"***\",\"***\",M150)","v":"***"},{"$f":"U181","v":"***"},{"$f":"IF(W175=\"***\",\"***\",M155)","v":"***"},{"$f":"IF(X175=\"***\",\"***\",M156)","v":"***"},{"$f":"X181","v":"***"}]
[null,null,null,null,null,null,null,null,null,{"$f":"J176","v":"FT Education"},{"$f":"IF(K176=\"***\",\"***\",J143)","v":""},{"$f":"IF(L176=\"***\",\"***\",J144)","v":""},{"$f":"L182","v":""},{"$f":"IF(N176=\"***\",\"***\",J145)","v":""},{"$f":"IF(O176=\"***\",\"***\",J147)","v":""},{"$f":"O182","v":""},{"$f":"IF(Q176=\"***\",\"***\",J151)","v":""},{"$f":"IF(R176=\"***\",\"***\",J153)","v":""},{"$f":"R182","v":""},{"$f":"IF(T176=\"***\",\"***\",J148)","v":""},{"$f":"IF(U176=\"***\",\"***\",J150)","v":""},{"$f":"U182","v":""},{"$f":"IF(W176=\"***\",\"***\",J155)","v":"***"},{"$f":"IF(X176=\"***\",\"***\",J156)","v":"***"},{"$f":"X182","v":"***"}]
[null,null,null,null,null,null,null,null,null,{"$f":"J177","v":"PT Education"},{"$f":"IF(K177=\"***\",\"***\",K143)","v":""},{"$f":"IF(L177=\"***\",\"***\",K144)","v":""},{"$f":"L183","v":""},{"$f":"IF(N177=\"***\",\"***\",K145)","v":""},{"$f":"IF(O177=\"***\",\"***\",K147)","v":""},{"$f":"O183","v":""},{"$f":"IF(Q177=\"***\",\"***\",K151)","v":"*"},{"$f":"IF(R177=\"***\",\"***\",K153)","v":"*"},{"$f":"R183","v":"*"},{"$f":"IF(T177=\"***\",\"***\",K148)","v":""},{"$f":"IF(U177=\"***\",\"***\",K150)","v":""},{"$f":"U183","v":""},{"$f":"IF(W177=\"***\",\"***\",K155)","v":"***"},{"$f":"IF(X177=\"***\",\"***\",K156)","v":"***"},{"$f":"X183","v":"***"}]
[null,null,null,null,null,null,null,null,null,{"$f":"J178","v":"Not in Education"},{"$f":"IF(K178=\"***\",\"***\",L143)","v":""},{"$f":"IF(L178=\"***\",\"***\",L144)","v":""},{"$f":"L184","v":""},{"$f":"IF(N178=\"***\",\"***\",L145)","v":""},{"$f":"IF(O178=\"***\",\"***\",L147)","v":""},{"$f":"O184","v":""},{"$f":"IF(Q178=\"***\",\"***\",L151)","v":""},{"$f":"IF(R178=\"***\",\"***\",L153)","v":""},{"$f":"R184","v":""},{"$f":"IF(T178=\"***\",\"***\",L148)","v":""},{"$f":"IF(U178=\"***\",\"***\",L150)","v":""},{"$f":"U184","v":""},{"$f":"IF(W178=\"***\",\"***\",L155)","v":"***"},{"$f":"IF(X178=\"***\",\"***\",L156)","v":"***"},{"$f":"X184","v":"***"}]
[null,null,null,null,"Title",null,null,null,null,{"$f":"J179","v":"All"},{"$f":"IF(K179=\"***\",\"***\",IF(ISBLANK(VLOOKUP(\"Scotland\",'Main Table'!$A$39:$BX$74,K180,FALSE))=TRUE,\"\",VLOOKUP(\"Scotland\",'Main Table'!$A$39:$BX$74,K180,FALSE)))","v":""}]
[null,null,null,null,{"$f":"\"A. Levels and proportions of economic activity for young people by education status, \"&E117&\", Jan 2018 to Dec 2020\"","v":"A. Levels and proportions of economic activity for young people by education status, Scotland, Jan 2018 to Dec 2020"}]
[]
[]
[null,null,null,null,"EDUCATION"]
[null,null,null,null,{"$f":"'Area Profile'!D7","v":"Scotland"}]
[]
[null,null,null,null,"All",null,null,null,null,null,"Not Full-Time Education"]
[]
[null,null,null,null,"Level",null,null,"Lookup",5,null,"Level"]
[null,null,null,null,null,null,"Employed","Inactive","ILO Unemployed",null,null,null,"Employed","Inactive","ILO Unemployed"]
[null,null,null,null,{"$f":"E190","v":"Scotland"},null,{"$f":"TEXT(VLOOKUP(E196&G195&$E$192,Education!A:H,I194,FALSE),\"#,##0\")","v":"315,900"},{"$f":"TEXT(VLOOKUP(E196&H195&E192,Education!A:H,I194,FALSE),\"#,##0\")","v":"218,800"},{"$f":"TEXT(VLOOKUP(E196&I195&E192,Education!A:H,I194,FALSE),\"#,##0\")","v":"30,900"},null,{"$f":"E190","v":"Scotland"},null,{"$f":"TEXT(VLOOKUP(K196&M195&K192,Education!A:H,I194,FALSE),\"#,##0\")","v":"232,400"},{"$f":"TEXT(VLOOKUP(K196&N195&K192,Education!A:H,I194,FALSE),\"#,##0\")","v":"55,300"},{"$f":"TEXT(VLOOKUP(K196&O195&K192,Education!A:H,I194,FALSE),\"#,##0\")","v":"21,500"}]
[null,null,null,null,"Scotland",null,{"$f":"TEXT(VLOOKUP(E197&G195&E192,Education!A:H,I194,FALSE),\"#,##0\")","v":"315,900"},{"$f":"TEXT(VLOOKUP(E197&H195&E192,Education!A:H,I194,FALSE),\"#,##0\")","v":"218,800"},{"$f":"TEXT(VLOOKUP(E197&I195&E192,Education!A:H,I194,FALSE),\"#,##0\")","v":"30,900"},null,"Scotland",null,{"$f":"TEXT(VLOOKUP(K197&M195&K192,Education!A:H,I194,FALSE),\"#,##0\")","v":"232,400"},{"$f":"TEXT(VLOOKUP(K197&N195&K192,Education!A:H,I194,FALSE),\"#,##0\")","v":"55,300"},{"$f":"TEXT(VLOOKUP(K197&O195&K192,Education!A:H,I194,FALSE),\"#,##0\")","v":"21,500"}]
[]
[null,null,null,null,"Rate",null,null,"Lookup",6,null,"Rate"]
[null,null,null,null,null,null,"Employed","Inactive","ILO Unemployed",null,null,null,"Employed","Inactive","ILO Unemployed"]
[null,null,null,null,{"$f":"E190","v":"Scotland"},null,{"$f":"TEXT(100*VLOOKUP(E201&G200&$E$192,Education!A:H,I199,FALSE),\"0.0\")","v":"55.9"},{"$f":"TEXT(100*VLOOKUP(E201&H200&E192,Education!A:H,I199,FALSE),\"0.0\")","v":"38.7"},{"$f":"TEXT(100*VLOOKUP(E201&I200&E192,Education!A:H,I199,FALSE),\"0.0\")","v":"8.9"},null,{"$f":"E190","v":"Scotland"},null,{"$f":"TEXT(100*VLOOKUP(K201&M200&K192,Education!A:H,I199,FALSE),\"0.0\")","v":"75.2"},{"$f":"TEXT(100*VLOOKUP(K201&N200&K192,Education!A:H,I199,FALSE),\"0.0\")","v":"17.9"},{"$f":"TEXT(100*VLOOKUP(K201&O200&K192,Education!A:H,I199,FALSE),\"0.0\")","v":"8.5"}]
[null,null,null,null,"Scotland",null,{"$f":"TEXT(100*VLOOKUP(E202&G200&E192,Education!A:H,I199,FALSE),\"0.0\")","v":"55.9"},{"$f":"TEXT(100*VLOOKUP(E202&H200&E192,Education!A:H,I199,FALSE),\"0.0\")","v":"38.7"},{"$f":"TEXT(100*VLOOKUP(E202&I200&E192,Education!A:H,I199,FALSE),\"0.0\")","v":"8.9"},null,"Scotland",null,{"$f":"TEXT(100*VLOOKUP(K202&M200&K192,Education!A:H,I199,FALSE),\"0.0\")","v":"75.2"},{"$f":"TEXT(100*VLOOKUP(K202&N200&K192,Education!A:H,I199,FALSE),\"0.0\")","v":"17.9"},{"$f":"TEXT(100*VLOOKUP(K202&O200&K192,Education!A:H,I199,FALSE),\"0.0\")","v":"8.5"}]
[]
[null,null,null,null,"CI",null,null,"Lookup",7,null,"CI"]
[null,null,null,null,null,null,"Employed","Inactive","ILO Unemployed",null,null,null,"Employed","Inactive","ILO Unemployed"]
[null,null,null,null,{"$f":"E190","v":"Scotland"},null,{"$f":"IF(VLOOKUP(E206&G205&E192,Education!A:H,I204,FALSE)=\".\",\"#\",TEXT(100*VLOOKUP(E206&G205&E192,Education!A:H,I204,FALSE),\" ± 0.0\"))","v":" ± 1.5"},{"$f":"IF(VLOOKUP(E206&H205&E192,Education!A:H,I204,FALSE)=\".\",\"#\",TEXT(100*VLOOKUP(E206&H205&E192,Education!A:H,I204,FALSE),\" ± 0.0\"))","v":" ± 1.5"},{"$f":"IF(VLOOKUP(E206&I205&E192,Education!A:H,I204,FALSE)=\".\",\"#\",TEXT(100*VLOOKUP(E206&I205&E192,Education!A:H,I204,FALSE),\" ± 0.0\"))","v":" ± 1.1"},null,{"$f":"E190","v":"Scotland"},null,{"$f":"IF(VLOOKUP(K206&M205&K192,Education!A:H,I204,FALSE)=\".\",\"#\",TEXT(100*VLOOKUP(K206&M205&K192,Education!A:H,I204,FALSE),\" ± 0.0\"))","v":" ± 1.8"},{"$f":"IF(VLOOKUP(K206&N205&K192,Education!A:H,I204,FALSE)=\".\",\"#\",TEXT(100*VLOOKUP(K206&N205&K192,Education!A:H,I204,FALSE),\" ± 0.0\"))","v":" ± 1.6"},{"$f":"IF(VLOOKUP(K206&O205&K192,Education!A:H,I204,FALSE)=\".\",\"#\",TEXT(100*VLOOKUP(K206&O205&K192,Education!A:H,I204,FALSE),\" ± 0.0\"))","v":" ± 1.3"}]
[null,null,null,null,"Scotland",null,{"$f":"IF(VLOOKUP(E207&G205&E192,Education!A:H,I204,FALSE)=\".\",\"#\",TEXT(100*VLOOKUP(E207&G205&E192,Education!A:H,I204,FALSE),\" ± 0.0\"))","v":" ± 1.5"},{"$f":"IF(VLOOKUP(E207&H205&E192,Education!A:H,I204,FALSE)=\".\",\"#\",TEXT(100*VLOOKUP(E207&H205&E192,Education!A:H,I204,FALSE),\" ± 0.0\"))","v":" ± 1.5"},{"$f":"IF(VLOOKUP(E207&I205&E192,Education!A:H,I204,FALSE)=\".\",\"#\",TEXT(100*VLOOKUP(E207&I205&E192,Education!A:H,I204,FALSE),\" ± 0.0\"))","v":" ± 1.1"},null,"Scotland",null,{"$f":"IF(VLOOKUP(K207&M205&K192,Education!A:H,I204,FALSE)=\".\",\"#\",TEXT(100*VLOOKUP(K207&M205&K192,Education!A:H,I204,FALSE),\" ± 0.0\"))","v":" ± 1.8"},{"$f":"IF(VLOOKUP(K207&N205&K192,Education!A:H,I204,FALSE)=\".\",\"#\",TEXT(100*VLOOKUP(K207&N205&K192,Education!A:H,I204,FALSE),\" ± 0.0\"))","v":" ± 1.6"},{"$f":"IF(VLOOKUP(K207&O205&K192,Education!A:H,I204,FALSE)=\".\",\"#\",TEXT(100*VLOOKUP(K207&O205&K192,Education!A:H,I204,FALSE),\" ± 0.0\"))","v":" ± 1.3"}]
[]
[null,null,null,null,"SDC",null,null,"Lookup",8,null,"SDC"]
[null,null,null,null,null,null,"Employed","Inactive","ILO Unemployed",null,null,null,"Employed","Inactive","ILO Unemployed"]
[null,null,null,null,{"$f":"E190","v":"Scotland"},null,{"$f":"IF(ISBLANK(VLOOKUP(E211&G210&E192,Education!A:H,I209,FALSE))=TRUE,\"\",VLOOKUP(E211&G210&E192,Education!A:H,I209,FALSE))","v":""},{"$f":"IF(ISBLANK(VLOOKUP(E211&H210&E192,Education!A:H,I209,FALSE))=TRUE,\"\",VLOOKUP(E211&H210&E192,Education!A:H,I209,FALSE))","v":""},{"$f":"IF(ISBLANK(VLOOKUP(E211&I210&E192,Education!A:H,I209,FALSE))=TRUE,\"\",VLOOKUP(E211&I210&E192,Education!A:H,I209,FALSE))","v":""},null,{"$f":"E190","v":"Scotland"},null,{"$f":"IF(ISBLANK(VLOOKUP(K211&M210&K192,Education!A:H,I209,FALSE))=TRUE,\"\",VLOOKUP(K211&M210&K192,Education!A:H,I209,FALSE))","v":""},{"$f":"IF(ISBLANK(VLOOKUP(K211&N210&K192,Education!A:H,I209,FALSE))=TRUE,\"\",VLOOKUP(K211&N210&K192,Education!A:H,I209,FALSE))","v":""},{"$f":"IF(ISBLANK(VLOOKUP(K211&O210&K192,Education!A:H,I209,FALSE))=TRUE,\"\",VLOOKUP(K211&O210&K192,Education!A:H,I209,FALSE))","v":""}]
[null,null,null,null,"Scotland",null,{"$f":"IF(ISBLANK(VLOOKUP(E212&G210&E192,Education!A:H,I209,FALSE))=TRUE,\"\",VLOOKUP(E212&G210&E192,Education!A:H,I209,FALSE))","v":""},{"$f":"IF(ISBLANK(VLOOKUP(E212&H210&E192,Education!A:H,I209,FALSE))=TRUE,\"\",VLOOKUP(E212&H210&E192,Education!A:H,I209,FALSE))","v":""},{"$f":"IF(ISBLANK(VLOOKUP(E212&I210&E192,Education!A:H,I209,FALSE))=TRUE,\"\",VLOOKUP(E212&I210&E192,Education!A:H,I209,FALSE))","v":""},null,"Scotland",null,{"$f":"IF(ISBLANK(VLOOKUP(K212&M210&K192,Education!A:H,I209,FALSE))=TRUE,\"\",VLOOKUP(K212&M210&K192,Education!A:H,I209,FALSE))","v":""},{"$f":"IF(ISBLANK(VLOOKUP(K212&N210&K192,Education!A:H,I209,FALSE))=TRUE,\"\",VLOOKUP(K212&N210&K192,Education!A:H,I209,FALSE))","v":""},{"$f":"IF(ISBLANK(VLOOKUP(K212&O210&K192,Education!A:H,I209,FALSE))=TRUE,\"\",VLOOKUP(K212&O210&K192,Education!A:H,I209,FALSE))","v":""}]
[]
[null,null,null,null,"Area",null,null,null,null,null,"Area"]
[null,null,null,null,null,null,"Employment","Inactivity ","Unemployment",null,null,null,"Employment","Inactivity","Unemployment"]
[null,null,null,null,{"$f":"E190","v":"Scotland"},null,{"$f":"IF(G211=\"***\",\"\",G201&G211)","v":"55.9"},{"$f":"IF(H211=\"***\",\"\",H201&H211)","v":"38.7"},"8.9",null,{"$f":"E190","v":"Scotland"},null,{"$f":"IF(M211=\"***\",\"\",M201&M211)","v":"75.2"},{"$f":"IF(N211=\"***\",\"\",N201&N211)","v":"17.9"},"8.5"]
[null,null,null,null,{"$f":"IF($E$190=\"Scotland\",\"\",\"Scotland\")","v":""},null,{"$f":"IF(E217=\"\",\"\",IF(G212=\"***\",\"\",G202&G212))","v":""},{"$f":"IF(E217=\"\",\"\",IF(H212=\"***\",\"\",H202&H212))","v":""},{"$f":"IF(E217=\"\",\"\",IF(I212=\"***\",\"\",I202&I212))","v":""},null,{"$f":"IF($E$190=\"Scotland\",\"\",\"Scotland\")","v":""},null,{"$f":"IF(K217=\"\",\"\",IF(M212=\"***\",\"\",M202&M212))","v":""},{"$f":"IF(K217=\"\",\"\",IF(N212=\"***\",\"\",N202&N212))","v":""},{"$f":"IF(K217=\"\",\"\",IF(O212=\"***\",\"\",O202&O212))","v":""}]
[]
[null,null,null,null,"Text",null,null,null,null,null,"Text"]
[null,null,null,null,"Employment",{"$f":"IF(VALUE(G201)<VALUE(G202),\" a lower \",IF(VALUE(G201)>VALUE(G202),\" a higher \",\" the same \"))","v":" the same "},{"$f":"IF(F220=F221,\" but\",\" and\")","v":" but"},null,null,null,"Employment",{"$f":"IF(VALUE(M201)<VALUE(M202),\" a lower \",IF(VALUE(M201)>VALUE(M202),\" a higher \",\" the same \"))","v":" the same "},{"$f":"IF(L220=L221,\" but\",\" and\")","v":" but"}]
[null,null,null,null,"Unemployment",{"$f":"IF(VALUE(I201)<VALUE(I202),\" a lower \",IF(VALUE(I201)>VALUE(I202),\" a higher \",\" the same \"))","v":" the same "},null,null,null,null,"Unemployment",{"$f":"IF(VALUE(O201)<VALUE(O202),\" a lower \",IF(VALUE(O201)>VALUE(O202),\" a higher \",\" the same \"))","v":" the same "}]
[]
[null,null,null,null,"Employment SDC",{"$f":"IF(G211=\"***\",IF(G212=\"***\",0,0),IF(G212=\"***\",0,1))","v":1},"Unemployment SDC",{"$f":"IF(I211=\"***\",IF(I212=\"***\",0,0),IF(I212=\"***\",0,1))","v":1},null,null,"Employment SDC",{"$f":"IF(M211=\"***\",IF(M212=\"***\",0,0),IF(M212=\"***\",0,1))","v":1},"Unemployment SDC",{"$f":"IF(O211=\"***\",IF(O212=\"***\",0,0),IF(O212=\"***\",0,1))","v":1}]
[null,null,null,null,"Indicators",{"$f":"IF(F220=F221,1,0)","v":1},"Combined",{"$f":"F223&H223&F224","v":"111"},null,null,"Indicators",{"$f":"IF(L220=L221,1,0)","v":1},"Combined",{"$f":"L223&N223&L224","v":"111"}]
[]
[null,null,null,null,{"$f":"F220&\"employment rate compared to Scotland\"","v":" the same employment rate compared to Scotland"},null,null,null,null,null,{"$f":"L220&\"employment rate compared to Scotland\"","v":" the same employment rate compared to Scotland"}]
[null,null,null,null,{"$f":"F221&\"unemployment rate compared to Scotland\"","v":" the same unemployment rate compared to Scotland"},null,null,null,null,null,{"$f":"L221&\"unemployment rate compared to Scotland\"","v":" the same unemployment rate compared to Scotland"}]
[]
[null,null,null,null,null,null,{"$f":"\"Data for the period 2018 to 2020 is considered unreliable for comparing the employment and unemployment rates between \"&E190&\" and Scotland.\"","v":"Data for the period 2018 to 2020 is considered unreliable for comparing the employment and unemployment rates between Scotland and Scotland."}]
[]
[null,null,null,null,{"$f":"IF(OR(H224=\"110\",H224=\"111\"),\" has\"&E226&G220&E227,IF(OR(H224=\"101\",H224=\"100\")=TRUE,\" has\"&E226,IF(OR(H224=\"011\",H224=\"010\")=TRUE,\" has\"&E227,G229)))","v":" has the same employment rate compared to Scotland but the same unemployment rate compared to Scotland"}]
[null,null,null,null,null,null,null,null,null,null,{"$f":"IF(OR(N224=\"110\",N224=\"111\"),\" has\"&K226&M220&K227,IF(OR(N224=\"101\",N224=\"100\")=TRUE,\" has\"&K226,IF(OR(N224=\"011\",N224=\"010\")=TRUE,\" has\"&K227,M229)))","v":" has the same employment rate compared to Scotland but the same unemployment rate compared to Scotland"}]
[null,null,null,null,{"$f":"IF(OR(H224=\"001\",H224=\"000\")=TRUE,E231,E190&E231&\".\")","v":"Scotland has the same employment rate compared to Scotland but the same unemployment rate compared to Scotland."}]
[null,null,null,null,null,null,null,null,null,null,{"$f":"IF(OR(N224=\"001\",N224=\"000\")=TRUE,K232,E190&K232&\".\")","v":"Scotland has the same employment rate compared to Scotland but the same unemployment rate compared to Scotland."}]
[null,null,null,null,{"$f":"IF($E$190=\"Scotland\",\"Scotland employment, inactivity, and unemployment rates\",E233)","v":"Scotland employment, inactivity, and unemployment rates"}]
[null,null,null,null,null,null,null,null,null,null,{"$f":"IF($E$190=\"Scotland\",\"Scotland employment, inactivity, and unemployment rates\",K234)","v":"Scotland employment, inactivity, and unemployment rates"}]
[null,null,null,null,"Title"]
[null,null,null,null,{"$f":"IF(E190=\"Scotland\",\"B1. Levels and proportions of economic activity for young people including those in full-time education, \n\"&E190&\", Jan 2018 to Dec 2020\",\"B1. Levels and proportions of economic activity for young people including those in full-time education, \n\"&E190&\" and Scotland, Jan 2018 to Dec 2020\")","v":"B1. Levels and proportions of economic activity for young people including those in full-time education, \nScotland, Jan 2018 to Dec 2020"}]
[null,null,null,null,null,null,null,null,null,null,{"$f":"IF(E190=\"Scotland\",\"B2. Levels and proportions of economic activity for young people excluding those in full-time education, \n\"&E190&\", Jan 2018 to Dec 2020\",\"B2. Levels and proportions of economic activity for young people excluding those in full-time education, \n\"&E190&\" and Scotland, Jan 2018 to Dec 2020\")","v":"B2. Levels and proportions of economic activity for young people excluding those in full-time education, \nScotland, Jan 2018 to Dec 2020"}]
[]
[null,null,null,null,"PARTICIPATION"]
[null,null,null,null,{"$f":"'Area Profile'!D7","v":"Scotland"}]
[]
[null,null,null,null,null,"Remaining","Education","Employment","Training and Development",null,"Year",{"$f":"E242","v":"Scotland"},"Text",{"$f":"IF(E242=\"Scotland\",\"\",\"Scotland\")","v":""}]
[null,null,null,null,{"$f":"E242","v":"Scotland"},{"$f":"100-G245-H245-I245","v":7.900000000000003},{"$f":"ROUND(VLOOKUP(E242,Participation!B3:G35,4,FALSE),1)","v":74.8},{"$f":"ROUND(VLOOKUP(E242,Participation!B3:G35,5,FALSE),1)","v":15.5},{"$f":"ROUND(VLOOKUP(E242,Participation!B3:G35,6,FALSE),1)","v":1.8},null,{"$f":"Participation!A3","v":2021},{"$f":"ROUND(VLOOKUP(E242,Participation!B3:G35,3,FALSE)/100,3)","v":0.92200000000000004},{"$f":"TEXT(ROUND(VLOOKUP(E242,Participation!B3:G35,3,FALSE),1),\"0.0\")","v":"92.2"},{"$f":"IF(N244=\"\",\"\",ROUND(VLOOKUP(\"Scotland\",Participation!B3:G35,3,FALSE),1))","v":""}]
[null,null,null,null,{"$f":"IF(E242=\"Scotland\",\"\",\"Scotland\")","v":""},{"$f":"IF(E246=\"\",\"\",100-G246-H246-I246)","v":""},{"$f":"IF(E246=\"\",\"\",ROUND(VLOOKUP(\"Scotland\",Participation!B3:G35,4,FALSE),1))","v":""},{"$f":"IF(E246=\"\",\"\",ROUND(VLOOKUP(\"Scotland\",Participation!B3:G35,5,FALSE),1))","v":""},{"$f":"IF(E246=\"\",\"\",ROUND(VLOOKUP(\"Scotland\",Participation!B3:G35,6,FALSE),1))","v":""},null,{"$f":"Participation!A36","v":2020},{"$f":"ROUND(VLOOKUP(E242,Participation!B36:G68,3,FALSE)/100,3)","v":0.92100000000000004},{"$f":"TEXT(ROUND(VLOOKUP(E242,Participation!B36:G68,3,FALSE),1),\"0.0\")","v":"92.1"},{"$f":"IF(N244=\"\",\"\",ROUND(VLOOKUP(E242,Participation!B36:G68,3,FALSE),1))","v":""}]
[null,null,null,null,null,null,null,null,null,null,"Difference",{"$f":"(VLOOKUP(E242,Participation!B3:G35,3,FALSE)-VLOOKUP(E242,Participation!B36:G68,3,FALSE))/100","v":4.7122206040540961E-4},{"$f":"TEXT(ROUND(ABS(100*L247),1),\"0.0\")","v":"0.0"},{"$f":"IF(N244=\"\",\"\",ROUND(VLOOKUP(\"Scotland\",Participation!B3:G35,3,FALSE)-VLOOKUP(E242,Participation!B36:G68,3,FALSE),1))","v":""}]
[null,null,null,null,"Title"]
[null,null,null,null,"Table",{"$f":"\"6. Proportion of 16 to 19 year olds participating in employment, education, or training in \"&E242&\", 2021\"","v":"6. Proportion of 16 to 19 year olds participating in employment, education, or training in Scotland, 2021"}]
[null,null,null,null,"Chart",{"$f":"IF(E242=\"Scotland\",\"H. Proportion (per cent) of 16 to 19 year olds participating in employment, education, or training in \"&E242&\", 2021\",\"H. Proportion (per cent) of 16 to 19 year olds participating in employment, education, or training in \"&E242&\" and Scotland, 2021\")","v":"H. Proportion (per cent) of 16 to 19 year olds participating in employment, education, or training in Scotland, 2021"}]
[]
[null,null,null,null,"Text",null,null,null,"The overall participation rate in 2021 is slightly higher than in 2020 (92.2 per cent)."]
[null,null,null,null,{"$f":"IF(ROUND(100*L247,1)=0,\"Zero\",\"Non-Zero\")","v":"Zero"},{"$f":"IF(M245-M246=0,\"Zero\",\"Non-Zero\")","v":"Non-Zero"},{"$f":"IF(L247=0,\"same\",IF(L247>0,\"higher\",\"lower\"))","v":"higher"},{"$f":"IF(AND(E253=\"Zero\",E253=F253),\"\",IF(AND(E253=\"Zero\",E253<>F253),\"slightly \",IF(AND(E253=\"Non-Zero\",E253<>F253),\"\",\"\")))","v":"slightly "}]
[null,null,null,null,{"$f":"IF(G253=\"same\",\"At \"&M245&\" per cent, the overall participation rate in \"&K245&\" is the same as in \"&K246&\".\",\"At \"&M245&\" per cent, the overall participation rate in \"&K245&\" is \"&H253&G253&\" than in \"&K246&\" (\"&M246&\" per cent).\")","v":"At 92.2 per cent, the overall participation rate in 2021 is slightly higher than in 2020 (92.1 per cent)."}]
[]
[null,null,null,null,"Footnote"]
[null,null,null,null,"Source: Participation Measure, Skills Development Scotland, August 2021"]
[]
[]
[]
[null,null,null,null,"EMPLOYMENT"]
[null,null,null,null,{"$f":"'Area Profile'!D7","v":"Scotland"},null,"Year",2021]
[null,null,null,null,null,null,null,null,null,null,null,null,null,null,null,null,null,null,"Rate (per cent)",null,"CI (per cent)"]
[null,null,null,null,"Rank (w/o Joint)",null,"Lookup","Area","Level","Rate","SDC","CI","Rank (w Joint)","Ordered Rank (w/o Joint)","Area","Rate","SDC","Label","Rest","Selected","Rest","Selected","Ordered Rank (w Joint)"]
[null,null,null,null,{"$f":"_xlfn.RANK.EQ(J265,$J$265:$J$297)+COUNTIF($J$265:J265,J265)-1","v":31},{"$f":"_xlfn.RANK.EQ(J265,$J$265:$J$296)+COUNTIF($J$265:J265,J265)-1","v":30},{"$f":"$H$262&H265","v":"2021Aberdeen City"},"Aberdeen City",{"$f":"VLOOKUP(G265,Employment!A:F,4,FALSE)","v":6400},{"$f":"VLOOKUP(G265,Employment!A:F,6,FALSE)","v":0.3},{"$f":"VLOOKUP(G265,Employment!A:F,5,FALSE)","v":"*"},{"$f":"IF(VLOOKUP(G265,Employment!A:G,7,FALSE)=\".\",NA(),VLOOKUP(G265,Employment!A:G,7,FALSE))","v":0.13700000000000001},{"$f":"_xlfn.RANK.EQ(J265,$J$265:$J$296)","v":30},1,{"$f":"VLOOKUP(N265,$E$265:$H$297,4,FALSE)","v":"Highland"},{"$f":"VLOOKUP(O265,$H$265:$J$297,3,FALSE)","v":0.66500000000000004},{"$f":"VLOOKUP(O265,$H$265:$K$297,4,FALSE)","v":"*"},{"$f":"IF(Q265=\"*\",O265&Q265,O265)","v":"Highland*"},{"$f":"IF($E$262=O265,\"\",IF(Q265=\"***\",\"***\",100*P265))","v":66.5},{"$f":"IF($E$262=O265,IF(Q265=\"***\",\"***\",100*P265),\"\")","v":""},{"$f":"IF(OR(S265=\"***\",S265=\"\"),NA(),100*VLOOKUP(O265,$H$265:$L$297,5,FALSE))","v":15.4},{"$f":"IF(OR(T265=\"***\",T265=\"\"),NA(),100*VLOOKUP(O265,$H$265:$L$297,5,FALSE))","v":{"$error":"#N/A"}},{"$f":"VLOOKUP(O265,$H$265:$M$297,6,FALSE)","v":1},null,{"$f":"VLOOKUP(N265,$F$265:$H$297,3,FALSE)","v":"Highland"},{"$f":"IF(VLOOKUP(Y265,$H$265:$L$297,4,FALSE)=\"***\",\"***\",VLOOKUP(Y265,$H$265:$L$297,2,FALSE))","v":14100},{"$f":"IF(VLOOKUP(Y265,$H$265:$L$297,4,FALSE)=\"***\",\"***\",100*VLOOKUP(Y265,$H$265:$L$297,3,FALSE))","v":66.5},{"$f":"IF(VLOOKUP(Y265,$H$265:$L$297,4,FALSE)=\"***\",\"***\",IF(ISNA(VLOOKUP(Y265,$H$265:$L$297,5,FALSE))=TRUE,\"#\",100*VLOOKUP(Y265,$H$265:$L$297,5,FALSE)))","v":15.4},{"$f":"VLOOKUP(Y265,$H$265:$K$297,4,FALSE)","v":"*"}]
[null,null,null,null,{"$f":"_xlfn.RANK.EQ(J266,$J$265:$J$297)+COUNTIF($J$265:J266,J266)-1","v":8},{"$f":"_xlfn.RANK.EQ(J266,$J$265:$J$296)+COUNTIF($J$265:J266,J266)-1","v":8},{"$f":"$H$262&H266","v":"2021Aberdeenshire"},"Aberdeenshire",{"$f":"VLOOKUP(G266,Employment!A:F,4,FALSE)","v":14200},{"$f":"VLOOKUP(G266,Employment!A:F,6,FALSE)","v":0.56599999999999995},{"$f":"VLOOKUP(G266,Employment!A:F,5,FALSE)","v":0},{"$f":"IF(VLOOKUP(G266,Employment!A:G,7,FALSE)=\".\",NA(),VLOOKUP(G266,Employment!A:G,7,FALSE))","v":0.13600000000000001},{"$f":"_xlfn.RANK.EQ(J266,$J$265:$J$296)","v":8},2,{"$f":"VLOOKUP(N266,$E$265:$H$297,4,FALSE)","v":"South Lanarkshire"},0.66500000000000004,0,{"$f":"IF(Q266=\"*\",O266&Q266,O266)","v":"South Lanarkshire"},{"$f":"IF($E$262=O266,\"\",IF(Q266=\"***\",\"***\",100*P266))","v":66.5},{"$f":"IF($E$262=O266,IF(Q266=\"***\",\"***\",100*P266),\"\")","v":""},{"$f":"IF(OR(S266=\"***\",S266=\"\"),NA(),100*VLOOKUP(O266,$H$265:$L$297,5,FALSE))","v":13.200000000000001},{"$f":"IF(OR(T266=\"***\",T266=\"\"),NA(),100*VLOOKUP(O266,$H$265:$L$297,5,FALSE))","v":{"$error":"#N/A"}},1,null,{"$f":"VLOOKUP(N266,$F$265:$H$297,3,FALSE)","v":"South Lanarkshire"},{"$f":"IF(VLOOKUP(Y266,$H$265:$L$297,4,FALSE)=\"***\",\"***\",VLOOKUP(Y266,$H$265:$L$297,2,FALSE))","v":20600},{"$f":"IF(VLOOKUP(Y266,$H$265:$L$297,4,FALSE)=\"***\",\"***\",100*VLOOKUP(Y266,$H$265:$L$297,3,FALSE))","v":66.5},{"$f":"IF(VLOOKUP(Y266,$H$265:$L$297,4,FALSE)=\"***\",\"***\",IF(ISNA(VLOOKUP(Y266,$H$265:$L$297,5,FALSE))=TRUE,\"#\",100*VLOOKUP(Y266,$H$265:$L$297,5,FALSE)))","v":13.200000000000001},{"$f":"VLOOKUP(Y266,$H$265:$K$297,4,FALSE)","v":0}]
[null,null,null,null,{"$f":"_xlfn.RANK.EQ(J267,$J$265:$J$297)+COUNTIF($J$265:J267,J267)-1","v":19},{"$f":"_xlfn.RANK.EQ(J267,$J$265:$J$296)+COUNTIF($J$265:J267,J267)-1","v":18},"2021Angus","Angus",{"$f":"VLOOKUP(G267,Employment!A:F,4,FALSE)","v":6300},{"$f":"VLOOKUP(G267,Employment!A:F,6,FALSE)","v":0.48699999999999999},{"$f":"VLOOKUP(G267,Employment!A:F,5,FALSE)","v":0},{"$f":"IF(VLOOKUP(G267,Employment!A:G,7,FALSE)=\".\",NA(),VLOOKUP(G267,Employment!A:G,7,FALSE))","v":0.12},18,3,"Moray",0.64100000000000001,0,"Moray",64.099999999999994,"",14.2,{"$error":"#N/A"},3,null,"Moray",6400,64.099999999999994,14.2,0]
[null,null,null,null,{"$f":"_xlfn.RANK.EQ(J268,$J$265:$J$297)+COUNTIF($J$265:J268,J268)-1","v":15},{"$f":"_xlfn.RANK.EQ(J268,$J$265:$J$296)+COUNTIF($J$265:J268,J268)-1","v":14},"2021Argyll and Bute","Argyll and Bute",{"$f":"VLOOKUP(G268,Employment!A:F,4,FALSE)","v":2900},{"$f":"VLOOKUP(G268,Employment!A:F,6,FALSE)","v":0.51500000000000001},{"$f":"VLOOKUP(G268,Employment!A:F,5,FALSE)","v":"*"},{"$f":"IF(VLOOKUP(G268,Employment!A:G,7,FALSE)=\".\",NA(),VLOOKUP(G268,Employment!A:G,7,FALSE))","v":0.16800000000000001},14,4,"North Lanarkshire",0.63300000000000001,0,"North Lanarkshire",63.3,"",13.100000000000001,{"$error":"#N/A"},4,null,"North Lanarkshire",23700,63.3,13.100000000000001,0]
[null,null,null,null,{"$f":"_xlfn.RANK.EQ(J269,$J$265:$J$297)+COUNTIF($J$265:J269,J269)-1","v":18},{"$f":"_xlfn.RANK.EQ(J269,$J$265:$J$296)+COUNTIF($J$265:J269,J269)-1","v":17},"2021City of Edinburgh","City of Edinburgh",{"$f":"VLOOKUP(G269,Employment!A:F,4,FALSE)","v":29500},{"$f":"VLOOKUP(G269,Employment!A:F,6,FALSE)","v":0.49099999999999999},{"$f":"VLOOKUP(G269,Employment!A:F,5,FALSE)","v":0},{"$f":"IF(VLOOKUP(G269,Employment!A:G,7,FALSE)=\".\",NA(),VLOOKUP(G269,Employment!A:G,7,FALSE))","v":0.115},17,5,"East Dunbartonshire",0.61899999999999999,0,"East Dunbartonshire",61.9,"",11.799999999999999,{"$error":"#N/A"},5,null,"East Dunbartonshire",6600,61.9,11.799999999999999,0]
[null,null,null,null,{"$f":"_xlfn.RANK.EQ(J270,$J$265:$J$297)+COUNTIF($J$265:J270,J270)-1","v":9},{"$f":"_xlfn.RANK.EQ(J270,$J$265:$J$296)+COUNTIF($J$265:J270,J270)-1","v":9},"2021Clackmannanshire","Clackmannanshire",{"$f":"VLOOKUP(G270,Employment!A:F,4,FALSE)","v":2900},{"$f":"VLOOKUP(G270,Employment!A:F,6,FALSE)","v":0.54600000000000004},{"$f":"VLOOKUP(G270,Employment!A:F,5,FALSE)","v":"*"},{"$f":"IF(VLOOKUP(G270,Employment!A:G,7,FALSE)=\".\",NA(),VLOOKUP(G270,Employment!A:G,7,FALSE))","v":0.21299999999999999},9,6,"Renfrewshire",0.59899999999999998,0,"Renfrewshire",59.9,"",13.700000000000001,{"$error":"#N/A"},6,null,"Renfrewshire",10100,59.9,13.700000000000001,0]
[null,null,null,null,{"$f":"_xlfn.RANK.EQ(J271,$J$265:$J$297)+COUNTIF($J$265:J271,J271)-1","v":16},{"$f":"_xlfn.RANK.EQ(J271,$J$265:$J$296)+COUNTIF($J$265:J271,J271)-1","v":15},"2021Dumfries and Galloway","Dumfries and Galloway",{"$f":"VLOOKUP(G271,Employment!A:F,4,FALSE)","v":5200},{"$f":"VLOOKUP(G271,Employment!A:F,6,FALSE)","v":0.495},{"$f":"VLOOKUP(G271,Employment!A:F,5,FALSE)","v":"*"},{"$f":"IF(VLOOKUP(G271,Employment!A:G,7,FALSE)=\".\",NA(),VLOOKUP(G271,Employment!A:G,7,FALSE))","v":0.159},15,7,"Falkirk",0.57299999999999995,"*","Falkirk*",57.3,"",14.799999999999999,{"$error":"#N/A"},7,null,"Falkirk",9700,57.3,14.799999999999999,"*"]
[null,null,null,null,{"$f":"_xlfn.RANK.EQ(J272,$J$265:$J$297)+COUNTIF($J$265:J272,J272)-1","v":25},{"$f":"_xlfn.RANK.EQ(J272,$J$265:$J$296)+COUNTIF($J$265:J272,J272)-1","v":24},"2021Dundee City","Dundee City",{"$f":"VLOOKUP(G272,Employment!A:F,4,FALSE)","v":6800},{"$f":"VLOOKUP(G272,Employment!A:F,6,FALSE)","v":0.47799999999999998},{"$f":"VLOOKUP(G272,Employment!A:F,5,FALSE)","v":"*"},{"$f":"IF(VLOOKUP(G272,Employment!A:G,7,FALSE)=\".\",NA(),VLOOKUP(G272,Employment!A:G,7,FALSE))","v":0.13300000000000001},24,8,{"$f":"VLOOKUP(N272,$E$265:$H$297,4,FALSE)","v":"Aberdeenshire"},0.56599999999999995,0,"Aberdeenshire",56.599999999999994,"",13.600000000000001,{"$error":"#N/A"},8,null,"Aberdeenshire",14200,56.599999999999994,13.600000000000001,0]
[null,null,null,null,{"$f":"_xlfn.RANK.EQ(J273,$J$265:$J$297)+COUNTIF($J$265:J273,J273)-1","v":10},{"$f":"_xlfn.RANK.EQ(J273,$J$265:$J$296)+COUNTIF($J$265:J273,J273)-1","v":10},"2021East Ayrshire","East Ayrshire",{"$f":"VLOOKUP(G273,Employment!A:F,4,FALSE)","v":7100},{"$f":"VLOOKUP(G273,Employment!A:F,6,FALSE)","v":0.54300000000000004},{"$f":"VLOOKUP(G273,Employment!A:F,5,FALSE)","v":0},{"$f":"IF(VLOOKUP(G273,Employment!A:G,7,FALSE)=\".\",NA(),VLOOKUP(G273,Employment!A:G,7,FALSE))","v":0.13500000000000001},10,9,"Clackmannanshire",0.54600000000000004,"*","Clackmannanshire*",54.6,"",21.3,{"$error":"#N/A"},9,null,"Clackmannanshire",2900,54.6,21.3,"*"]
[null,null,null,null,{"$f":"_xlfn.RANK.EQ(J274,$J$265:$J$297)+COUNTIF($J$265:J274,J274)-1","v":5},{"$f":"_xlfn.RANK.EQ(J274,$J$265:$J$296)+COUNTIF($J$265:J274,J274)-1","v":5},"2021East Dunbartonshire","East Dunbartonshire",{"$f":"VLOOKUP(G274,Employment!A:F,4,FALSE)","v":6600},{"$f":"VLOOKUP(G274,Employment!A:F,6,FALSE)","v":0.61899999999999999},{"$f":"VLOOKUP(G274,Employment!A:F,5,FALSE)","v":0},{"$f":"IF(VLOOKUP(G274,Employment!A:G,7,FALSE)=\".\",NA(),VLOOKUP(G274,Employment!A:G,7,FALSE))","v":0.11799999999999999},5,10,"East Ayrshire",0.54300000000000004,0,"East Ayrshire",54.300000000000004,"",13.5,{"$error":"#N/A"},10,null,"East Ayrshire",7100,54.300000000000004,13.5,0]
[null,null,null,null,{"$f":"_xlfn.RANK.EQ(J275,$J$265:$J$297)+COUNTIF($J$265:J275,J275)-1","v":22},{"$f":"_xlfn.RANK.EQ(J275,$J$265:$J$296)+COUNTIF($J$265:J275,J275)-1","v":21},"2021East Lothian","East Lothian",{"$f":"VLOOKUP(G275,Employment!A:F,4,FALSE)","v":4400},{"$f":"VLOOKUP(G275,Employment!A:F,6,FALSE)","v":0.48099999999999998},{"$f":"VLOOKUP(G275,Employment!A:F,5,FALSE)","v":"*"},{"$f":"IF(VLOOKUP(G275,Employment!A:G,7,FALSE)=\".\",NA(),VLOOKUP(G275,Employment!A:G,7,FALSE))","v":0.161},21,11,"Midlothian",0.52500000000000002,"*","Midlothian*",52.5,"",16.5,{"$error":"#N/A"},11,null,"Midlothian",4400,52.5,16.5,"*"]
[null,null,null,null,{"$f":"_xlfn.RANK.EQ(J276,$J$265:$J$297)+COUNTIF($J$265:J276,J276)-1","v":30},{"$f":"_xlfn.RANK.EQ(J276,$J$265:$J$296)+COUNTIF($J$265:J276,J276)-1","v":29},"2021East Renfrewshire","East Renfrewshire",{"$f":"VLOOKUP(G276,Employment!A:F,4,FALSE)","v":3700},{"$f":"VLOOKUP(G276,Employment!A:F,6,FALSE)","v":0.377},{"$f":"VLOOKUP(G276,Employment!A:F,5,FALSE)","v":"*"},{"$f":"IF(VLOOKUP(G276,Employment!A:G,7,FALSE)=\".\",NA(),VLOOKUP(G276,Employment!A:G,7,FALSE))","v":0.13200000000000001},29,12,"Na h-Eileanan Siar",0.52300000000000002,"*","Na h-Eileanan Siar*",52.300000000000004,"",22.5,{"$error":"#N/A"},12,null,"Na h-Eileanan Siar",1300,52.300000000000004,22.5,"*"]
[null,null,null,null,{"$f":"_xlfn.RANK.EQ(J277,$J$265:$J$297)+COUNTIF($J$265:J277,J277)-1","v":7},{"$f":"_xlfn.RANK.EQ(J277,$J$265:$J$296)+COUNTIF($J$265:J277,J277)-1","v":7},"2021Falkirk","Falkirk",{"$f":"VLOOKUP(G277,Employment!A:F,4,FALSE)","v":9700},{"$f":"VLOOKUP(G277,Employment!A:F,6,FALSE)","v":0.57299999999999995},{"$f":"VLOOKUP(G277,Employment!A:F,5,FALSE)","v":"*"},{"$f":"IF(VLOOKUP(G277,Employment!A:G,7,FALSE)=\".\",NA(),VLOOKUP(G277,Employment!A:G,7,FALSE))","v":0.14799999999999999},7,13,"Scottish Borders",0.52300000000000002,"*","Scottish Borders*",52.300000000000004,"",14.299999999999999,{"$error":"#N/A"},12,null,"Scottish Borders",6500,52.300000000000004,14.299999999999999,"*"]
[null,null,null,null,{"$f":"_xlfn.RANK.EQ(J278,$J$265:$J$297)+COUNTIF($J$265:J278,J278)-1","v":20},{"$f":"_xlfn.RANK.EQ(J278,$J$265:$J$296)+COUNTIF($J$265:J278,J278)-1","v":19},"2021Fife","Fife",{"$f":"VLOOKUP(G278,Employment!A:F,4,FALSE)","v":16300},{"$f":"VLOOKUP(G278,Employment!A:F,6,FALSE)","v":0.48599999999999999},{"$f":"VLOOKUP(G278,Employment!A:F,5,FALSE)","v":"*"},{"$f":"IF(VLOOKUP(G278,Employment!A:G,7,FALSE)=\".\",NA(),VLOOKUP(G278,Employment!A:G,7,FALSE))","v":0.13600000000000001},19,14,"Scotland",0.51800000000000002,0,"Scotland","",51.800000000000004,{"$error":"#N/A"},2.6,33,null,"Argyll and Bute",2900,51.5,16.8,"*"]
[null,null,null,null,{"$f":"_xlfn.RANK.EQ(J279,$J$265:$J$297)+COUNTIF($J$265:J279,J279)-1","v":17},{"$f":"_xlfn.RANK.EQ(J279,$J$265:$J$296)+COUNTIF($J$265:J279,J279)-1","v":16},"2021Glasgow City","Glasgow City",{"$f":"VLOOKUP(G279,Employment!A:F,4,FALSE)","v":37800},{"$f":"VLOOKUP(G279,Employment!A:F,6,FALSE)","v":0.495},{"$f":"VLOOKUP(G279,Employment!A:F,5,FALSE)","v":0},{"$f":"IF(VLOOKUP(G279,Employment!A:G,7,FALSE)=\".\",NA(),VLOOKUP(G279,Employment!A:G,7,FALSE))","v":0.111},15,15,"Argyll and Bute",0.51500000000000001,"*","Argyll and Bute*",51.5,"",16.8,{"$error":"#N/A"},14,null,"Dumfries and Galloway",5200,49.5,15.9,"*"]
[null,null,null,null,{"$f":"_xlfn.RANK.EQ(J280,$J$265:$J$297)+COUNTIF($J$265:J280,J280)-1","v":1},{"$f":"_xlfn.RANK.EQ(J280,$J$265:$J$296)+COUNTIF($J$265:J280,J280)-1","v":1},"2021Highland","Highland",{"$f":"VLOOKUP(G280,Employment!A:F,4,FALSE)","v":14100},{"$f":"VLOOKUP(G280,Employment!A:F,6,FALSE)","v":0.66500000000000004},{"$f":"VLOOKUP(G280,Employment!A:F,5,FALSE)","v":"*"},{"$f":"IF(VLOOKUP(G280,Employment!A:G,7,FALSE)=\".\",NA(),VLOOKUP(G280,Employment!A:G,7,FALSE))","v":0.154},1,16,"Dumfries and Galloway",0.495,"*","Dumfries and Galloway*",49.5,"",15.9,{"$error":"#N/A"},15,null,"Glasgow City",37800,49.5,11.1,0]
[null,null,null,null,{"$f":"_xlfn.RANK.EQ(J281,$J$265:$J$297)+COUNTIF($J$265:J281,J281)-1","v":23},{"$f":"_xlfn.RANK.EQ(J281,$J$265:$J$296)+COUNTIF($J$265:J281,J281)-1","v":22},"2021Inverclyde","Inverclyde",{"$f":"VLOOKUP(G281,Employment!A:F,4,FALSE)","v":3600},{"$f":"VLOOKUP(G281,Employment!A:F,6,FALSE)","v":0.47899999999999998},{"$f":"VLOOKUP(G281,Employment!A:F,5,FALSE)","v":"*"},{"$f":"IF(VLOOKUP(G281,Employment!A:G,7,FALSE)=\".\",NA(),VLOOKUP(G281,Employment!A:G,7,FALSE))","v":0.14599999999999999},22,17,"Glasgow City",0.495,0,"Glasgow City",49.5,"",11.1,{"$error":"#N/A"},15,null,"City of Edinburgh",29500,49.1,11.5,0]
[null,null,null,null,{"$f":"_xlfn.RANK.EQ(J282,$J$265:$J$297)+COUNTIF($J$265:J282,J282)-1","v":11},{"$f":"_xlfn.RANK.EQ(J282,$J$265:$J$296)+COUNTIF($J$265:J282,J282)-1","v":11},"2021Midlothian","Midlothian",{"$f":"VLOOKUP(G282,Employment!A:F,4,FALSE)","v":4400},{"$f":"VLOOKUP(G282,Employment!A:F,6,FALSE)","v":0.52500000000000002},{"$f":"VLOOKUP(G282,Employment!A:F,5,FALSE)","v":"*"},{"$f":"IF(VLOOKUP(G282,Employment!A:G,7,FALSE)=\".\",NA(),VLOOKUP(G282,Employment!A:G,7,FALSE))","v":0.16500000000000001},11,18,"City of Edinburgh",0.49099999999999999,0,"City of Edinburgh",49.1,"",11.5,{"$error":"#N/A"},17,null,"Angus",6300,48.699999999999996,12,0]
[null,null,null,null,{"$f":"_xlfn.RANK.EQ(J283,$J$265:$J$297)+COUNTIF($J$265:J283,J283)-1","v":3},{"$f":"_xlfn.RANK.EQ(J283,$J$265:$J$296)+COUNTIF($J$265:J283,J283)-1","v":3},"2021Moray","Moray",{"$f":"VLOOKUP(G283,Employment!A:F,4,FALSE)","v":6400},{"$f":"VLOOKUP(G283,Employment!A:F,6,FALSE)","v":0.64100000000000001},{"$f":"VLOOKUP(G283,Employment!A:F,5,FALSE)","v":0},{"$f":"IF(VLOOKUP(G283,Employment!A:G,7,FALSE)=\".\",NA(),VLOOKUP(G283,Employment!A:G,7,FALSE))","v":0.14199999999999999},3,19,"Angus",0.48699999999999999,0,"Angus",48.699999999999996,"",12,{"$error":"#N/A"},18,null,"Fife",16300,48.6,13.600000000000001,"*"]
[null,null,null,null,{"$f":"_xlfn.RANK.EQ(J284,$J$265:$J$297)+COUNTIF($J$265:J284,J284)-1","v":12},{"$f":"_xlfn.RANK.EQ(J284,$J$265:$J$296)+COUNTIF($J$265:J284,J284)-1","v":12},"2021Na h-Eileanan Siar","Na h-Eileanan Siar",{"$f":"VLOOKUP(G284,Employment!A:F,4,FALSE)","v":1300},{"$f":"VLOOKUP(G284,Employment!A:F,6,FALSE)","v":0.52300000000000002},{"$f":"VLOOKUP(G284,Employment!A:F,5,FALSE)","v":"*"},{"$f":"IF(VLOOKUP(G284,Employment!A:G,7,FALSE)=\".\",NA(),VLOOKUP(G284,Employment!A:G,7,FALSE))","v":0.22500000000000001},12,20,"Fife",0.48599999999999999,"*","Fife*",48.6,"",13.600000000000001,{"$error":"#N/A"},19,null,"South Ayrshire",4900,48.4,15.1,"*"]
[null,null,null,null,{"$f":"_xlfn.RANK.EQ(J285,$J$265:$J$297)+COUNTIF($J$265:J285,J285)-1","v":26},{"$f":"_xlfn.RANK.EQ(J285,$J$265:$J$296)+COUNTIF($J$265:J285,J285)-1","v":25},"2021North Ayrshire","North Ayrshire",{"$f":"VLOOKUP(G285,Employment!A:F,4,FALSE)","v":4300},{"$f":"VLOOKUP(G285,Employment!A:F,6,FALSE)","v":0.437},{"$f":"VLOOKUP(G285,Employment!A:F,5,FALSE)","v":"*"},{"$f":"IF(VLOOKUP(G285,Employment!A:G,7,FALSE)=\".\",NA(),VLOOKUP(G285,Employment!A:G,7,FALSE))","v":0.16400000000000001},25,21,"South Ayrshire",0.48399999999999999,"*","South Ayrshire*",48.4,"",15.1,{"$error":"#N/A"},20,null,"East Lothian",4400,48.1,16.100000000000001,"*"]
[null,null,null,null,{"$f":"_xlfn.RANK.EQ(J286,$J$265:$J$297)+COUNTIF($J$265:J286,J286)-1","v":4},{"$f":"_xlfn.RANK.EQ(J286,$J$265:$J$296)+COUNTIF($J$265:J286,J286)-1","v":4},"2021North Lanarkshire","North Lanarkshire",{"$f":"VLOOKUP(G286,Employment!A:F,4,FALSE)","v":23700},{"$f":"VLOOKUP(G286,Employment!A:F,6,FALSE)","v":0.63300000000000001},{"$f":"VLOOKUP(G286,Employment!A:F,5,FALSE)","v":0},{"$f":"IF(VLOOKUP(G286,Employment!A:G,7,FALSE)=\".\",NA(),VLOOKUP(G286,Employment!A:G,7,FALSE))","v":0.13100000000000001},4,22,"East Lothian",0.48099999999999998,"*","East Lothian*",48.1,"",16.100000000000001,{"$error":"#N/A"},21,null,"Inverclyde",3600,47.9,14.6,"*"]
[null,null,null,null,{"$f":"_xlfn.RANK.EQ(J287,$J$265:$J$297)+COUNTIF($J$265:J287,J287)-1","v":32},{"$f":"_xlfn.RANK.EQ(J287,$J$265:$J$296)+COUNTIF($J$265:J287,J287)-1","v":31},"2021Orkney Islands","Orkney Islands",{"$f":"VLOOKUP(G287,Employment!A:F,4,FALSE)","v":0},{"$f":"VLOOKUP(G287,Employment!A:F,6,FALSE)","v":0},{"$f":"VLOOKUP(G287,Employment!A:F,5,FALSE)","v":"***"},{"$f":"IF(VLOOKUP(G287,Employment!A:G,7,FALSE)=\".\",NA(),VLOOKUP(G287,Employment!A:G,7,FALSE))","v":0},{"$f":"_xlfn.RANK.EQ(J287,$J$265:$J$296)","v":31},23,"Inverclyde",0.47899999999999998,"*","Inverclyde*",47.9,"",14.6,{"$error":"#N/A"},22,null,"West Lothian",9500,47.9,13.700000000000001,"*"]
[null,null,null,null,{"$f":"_xlfn.RANK.EQ(J288,$J$265:$J$297)+COUNTIF($J$265:J288,J288)-1","v":29},{"$f":"_xlfn.RANK.EQ(J288,$J$265:$J$296)+COUNTIF($J$265:J288,J288)-1","v":28},"2021Perth and Kinross","Perth and Kinross",{"$f":"VLOOKUP(G288,Employment!A:F,4,FALSE)","v":7800},{"$f":"VLOOKUP(G288,Employment!A:F,6,FALSE)","v":0.41},{"$f":"VLOOKUP(G288,Employment!A:F,5,FALSE)","v":"*"},{"$f":"IF(VLOOKUP(G288,Employment!A:G,7,FALSE)=\".\",NA(),VLOOKUP(G288,Employment!A:G,7,FALSE))","v":0.11899999999999999},28,24,"West Lothian",0.47899999999999998,"*","West Lothian*",47.9,"",13.700000000000001,{"$error":"#N/A"},22,null,"Dundee City",6800,47.8,13.3,"*"]
[null,null,null,null,{"$f":"_xlfn.RANK.EQ(J289,$J$265:$J$297)+COUNTIF($J$265:J289,J289)-1","v":6},{"$f":"_xlfn.RANK.EQ(J289,$J$265:$J$296)+COUNTIF($J$265:J289,J289)-1","v":6},"2021Renfrewshire","Renfrewshire",{"$f":"VLOOKUP(G289,Employment!A:F,4,FALSE)","v":10100},{"$f":"VLOOKUP(G289,Employment!A:F,6,FALSE)","v":0.59899999999999998},{"$f":"VLOOKUP(G289,Employment!A:F,5,FALSE)","v":0},{"$f":"IF(VLOOKUP(G289,Employment!A:G,7,FALSE)=\".\",NA(),VLOOKUP(G289,Employment!A:G,7,FALSE))","v":0.13700000000000001},6,25,"Dundee City",0.47799999999999998,"*",{"$f":"IF(Q289=\"*\",O289&Q289,O289)","v":"Dundee City*"},47.8,"",13.3,{"$error":"#N/A"},24,null,"North Ayrshire",4300,43.7,16.400000000000002,"*"]
[null,null,null,null,{"$f":"_xlfn.RANK.EQ(J290,$J$265:$J$297)+COUNTIF($J$265:J290,J290)-1","v":13},{"$f":"_xlfn.RANK.EQ(J290,$J$265:$J$296)+COUNTIF($J$265:J290,J290)-1","v":13},"2021Scottish Borders","Scottish Borders",{"$f":"VLOOKUP(G290,Employment!A:F,4,FALSE)","v":6500},{"$f":"VLOOKUP(G290,Employment!A:F,6,FALSE)","v":0.52300000000000002},{"$f":"VLOOKUP(G290,Employment!A:F,5,FALSE)","v":"*"},{"$f":"IF(VLOOKUP(G290,Employment!A:G,7,FALSE)=\".\",NA(),VLOOKUP(G290,Employment!A:G,7,FALSE))","v":0.14299999999999999},12,26,"North Ayrshire",0.437,"*","North Ayrshire*",43.7,"",16.400000000000002,{"$error":"#N/A"},25,null,"West Dunbartonshire",3400,42.5,15.7,"*"]
[null,null,null,null,{"$f":"_xlfn.RANK.EQ(J291,$J$265:$J$297)+COUNTIF($J$265:J291,J291)-1","v":33},{"$f":"_xlfn.RANK.EQ(J291,$J$265:$J$296)+COUNTIF($J$265:J291,J291)-1","v":32},"2021Shetland Islands","Shetland Islands",{"$f":"VLOOKUP(G291,Employment!A:F,4,FALSE)","v":0},{"$f":"VLOOKUP(G291,Employment!A:F,6,FALSE)","v":0},{"$f":"VLOOKUP(G291,Employment!A:F,5,FALSE)","v":"***"},{"$f":"IF(VLOOKUP(G291,Employment!A:G,7,FALSE)=\".\",NA(),VLOOKUP(G291,Employment!A:G,7,FALSE))","v":0},31,27,"West Dunbartonshire",0.42499999999999999,"*","West Dunbartonshire*",42.5,"",15.7,{"$error":"#N/A"},26,null,"Stirling",4200,42,14.099999999999998,"*"]
[null,null,null,null,{"$f":"_xlfn.RANK.EQ(J292,$J$265:$J$297)+COUNTIF($J$265:J292,J292)-1","v":21},{"$f":"_xlfn.RANK.EQ(J292,$J$265:$J$296)+COUNTIF($J$265:J292,J292)-1","v":20},"2021South Ayrshire","South Ayrshire",{"$f":"VLOOKUP(G292,Employment!A:F,4,FALSE)","v":4900},{"$f":"VLOOKUP(G292,Employment!A:F,6,FALSE)","v":0.48399999999999999},{"$f":"VLOOKUP(G292,Employment!A:F,5,FALSE)","v":"*"},{"$f":"IF(VLOOKUP(G292,Employment!A:G,7,FALSE)=\".\",NA(),VLOOKUP(G292,Employment!A:G,7,FALSE))","v":0.151},20,28,"Stirling",0.42,"*","Stirling*",42,"",14.099999999999998,{"$error":"#N/A"},27,null,"Perth and Kinross",7800,41,11.899999999999999,"*"]
[null,null,null,null,{"$f":"_xlfn.RANK.EQ(J293,$J$265:$J$297)+COUNTIF($J$265:J293,J293)-1","v":2},{"$f":"_xlfn.RANK.EQ(J293,$J$265:$J$296)+COUNTIF($J$265:J293,J293)-1","v":2},"2021South Lanarkshire","South Lanarkshire",{"$f":"VLOOKUP(G293,Employment!A:F,4,FALSE)","v":20600},{"$f":"VLOOKUP(G293,Employment!A:F,6,FALSE)","v":0.66500000000000004},{"$f":"VLOOKUP(G293,Employment!A:F,5,FALSE)","v":0},{"$f":"IF(VLOOKUP(G293,Employment!A:G,7,FALSE)=\".\",NA(),VLOOKUP(G293,Employment!A:G,7,FALSE))","v":0.13200000000000001},1,29,"Perth and Kinross",0.41,"*","Perth and Kinross*",41,"",11.899999999999999,{"$error":"#N/A"},28,null,"East Renfrewshire",3700,37.700000000000003,13.200000000000001,"*"]
[null,null,null,null,{"$f":"_xlfn.RANK.EQ(J294,$J$265:$J$297)+COUNTIF($J$265:J294,J294)-1","v":28},{"$f":"_xlfn.RANK.EQ(J294,$J$265:$J$296)+COUNTIF($J$265:J294,J294)-1","v":27},"2021Stirling","Stirling",{"$f":"VLOOKUP(G294,Employment!A:F,4,FALSE)","v":4200},{"$f":"VLOOKUP(G294,Employment!A:F,6,FALSE)","v":0.42},{"$f":"VLOOKUP(G294,Employment!A:F,5,FALSE)","v":"*"},{"$f":"IF(VLOOKUP(G294,Employment!A:G,7,FALSE)=\".\",NA(),VLOOKUP(G294,Employment!A:G,7,FALSE))","v":0.14099999999999999},27,30,"East Renfrewshire",0.377,"*","East Renfrewshire*",37.700000000000003,"",13.200000000000001,{"$error":"#N/A"},29,null,"Aberdeen City",6400,30,13.700000000000001,"*"]
[null,null,null,null,{"$f":"_xlfn.RANK.EQ(J295,$J$265:$J$297)+COUNTIF($J$265:J295,J295)-1","v":27},{"$f":"_xlfn.RANK.EQ(J295,$J$265:$J$296)+COUNTIF($J$265:J295,J295)-1","v":26},"2021West Dunbartonshire","West Dunbartonshire",{"$f":"VLOOKUP(G295,Employment!A:F,4,FALSE)","v":3400},{"$f":"VLOOKUP(G295,Employment!A:F,6,FALSE)","v":0.42499999999999999},{"$f":"VLOOKUP(G295,Employment!A:F,5,FALSE)","v":"*"},{"$f":"IF(VLOOKUP(G295,Employment!A:G,7,FALSE)=\".\",NA(),VLOOKUP(G295,Employment!A:G,7,FALSE))","v":0.157},26,31,"Aberdeen City",0.3,"*","Aberdeen City*",30,"",13.700000000000001,{"$error":"#N/A"},30,null,"Orkney Islands","***","***","***","***"]
[null,null,null,null,{"$f":"_xlfn.RANK.EQ(J296,$J$265:$J$297)+COUNTIF($J$265:J296,J296)-1","v":24},{"$f":"_xlfn.RANK.EQ(J296,$J$265:$J$296)+COUNTIF($J$265:J296,J296)-1","v":23},"2021West Lothian","West Lothian",{"$f":"VLOOKUP(G296,Employment!A:F,4,FALSE)","v":9500},{"$f":"VLOOKUP(G296,Employment!A:F,6,FALSE)","v":0.47899999999999998},{"$f":"VLOOKUP(G296,Employment!A:F,5,FALSE)","v":"*"},{"$f":"IF(VLOOKUP(G296,Employment!A:G,7,FALSE)=\".\",NA(),VLOOKUP(G296,Employment!A:G,7,FALSE))","v":0.13700000000000001},22,32,"Orkney Islands",0,"***","Orkney Islands","***","",{"$error":"#N/A"},{"$error":"#N/A"},31,null,"Shetland Islands","***","***","***","***"]
[null,null,null,null,{"$f":"_xlfn.RANK.EQ(J297,$J$265:$J$297)+COUNTIF($J$265:J297,J297)-1","v":14},33,"2021Scotland","Scotland",{"$f":"VLOOKUP(G297,Employment!A:F,4,FALSE)","v":285700},{"$f":"VLOOKUP(G297,Employment!A:F,6,FALSE)","v":0.51800000000000002},{"$f":"VLOOKUP(G297,Employment!A:F,5,FALSE)","v":0},{"$f":"IF(VLOOKUP(G297,Employment!A:G,7,FALSE)=\".\",NA(),VLOOKUP(G297,Employment!A:G,7,FALSE))","v":2.5999999999999999E-2},33,33,"Shetland Islands",0,"***","Shetland Islands","***","",{"$error":"#N/A"},{"$error":"#N/A"},31,null,"Scotland",285700,51.800000000000004,2.6,0]
[]
[]
[null,null,null,null,null,null,"Area",null,null,null,null,null,null,null,null,null,null,null,null,null,null,null,{"$f":"IF(E262=\"Scotland\",\"\",\"Scotland\")","v":""}]
[null,null,null,null,"Year",null,"Lookup","Level","Rate","CI","SDC","X-Axis",null,null,null,null,"Lookup","Level","Rate","CI","SDC",null,"Rate"]
[null,null,null,null,2005,null,{"$f":"E302&$E$262","v":"2005Scotland"},{"$f":"IF(K302=\"***\",NA(),VLOOKUP(G302,Employment!A:G,4,FALSE))","v":373400},{"$f":"IF(K302=\"***\",NA(),100*VLOOKUP(G302,Employment!A:G,6,FALSE))","v":63.7},{"$f":"IF(K302=\"***\",0,IF(VLOOKUP(G302,Employment!A:G,7,FALSE)=\".\",\"#\",100*VLOOKUP(G302,Employment!A:G,7,FALSE)))","v":1.3},{"$f":"VLOOKUP(G302,Employment!A:F,5,FALSE)","v":0},{"$f":"IF(K302=0,TEXT(E302-1&\"/\"&RIGHT(E302,2), \"0000/00\"),TEXT(E302-1&\"/\"&RIGHT(E302,2), \"0000/00\")&K302)","v":"2004/05"},{"$f":"IF(K302=\"***\",NA(),I302)","v":63.7},63.7,null,{"$f":"IF(K302=\"***\",100,\"\")","v":""},{"$f":"E302&\"Scotland\"","v":"2005Scotland"},{"$f":"IF(U302=\"***\",NA(),VLOOKUP(Q302,Employment!A:G,4,FALSE))","v":373400},{"$f":"IF(U302=\"***\",NA(),100*VLOOKUP(Q302,Employment!A:G,6,FALSE))","v":63.7},{"$f":"IF(U302=\"***\",0,IF(VLOOKUP(Q302,Employment!A:G,7,FALSE)=\".\",\"#\",100*VLOOKUP(Q302,Employment!A:G,7,FALSE)))","v":1.3},{"$f":"VLOOKUP(Q302,Employment!A:F,5,FALSE)","v":0},null,{"$f":"IF(E262=\"Scotland\",NA(),IF(U302=\"***\",NA(),S302))","v":{"$error":"#N/A"}}]
[null,null,null,null,2006,null,"2006Scotland",{"$f":"IF(K303=\"***\",NA(),VLOOKUP(G303,Employment!A:G,4,FALSE))","v":371500},{"$f":"IF(K303=\"***\",NA(),100*VLOOKUP(G303,Employment!A:G,6,FALSE))","v":62.9},{"$f":"IF(K303=\"***\",0,IF(VLOOKUP(G303,Employment!A:G,7,FALSE)=\".\",\"#\",100*VLOOKUP(G303,Employment!A:G,7,FALSE)))","v":1.4000000000000001},{"$f":"VLOOKUP(G303,Employment!A:F,5,FALSE)","v":0},{"$f":"IF(K303=0,TEXT(E303-1&\"/\"&RIGHT(E303,2), \"0000/00\"),TEXT(E303-1&\"/\"&RIGHT(E303,2), \"0000/00\")&K303)","v":"2005/06"},{"$f":"IF(K303=\"***\",NA(),I303)","v":62.9},62.9,null,"",{"$f":"E303&\"Scotland\"","v":"2006Scotland"},{"$f":"IF(U303=\"***\",NA(),VLOOKUP(Q303,Employment!A:G,4,FALSE))","v":371500},{"$f":"IF(U303=\"***\",NA(),100*VLOOKUP(Q303,Employment!A:G,6,FALSE))","v":62.9},{"$f":"IF(U303=\"***\",0,IF(VLOOKUP(Q303,Employment!A:G,7,FALSE)=\".\",\"#\",100*VLOOKUP(Q303,Employment!A:G,7,FALSE)))","v":1.4000000000000001},{"$f":"VLOOKUP(Q303,Employment!A:F,5,FALSE)","v":0},null,{"$f":"IF(E262=\"Scotland\",NA(),IF(U303=\"***\",NA(),S303))","v":{"$error":"#N/A"}}]
[null,null,null,null,2007,null,"2007Scotland",{"$f":"IF(K304=\"***\",NA(),VLOOKUP(G304,Employment!A:G,4,FALSE))","v":377600},{"$f":"IF(K304=\"***\",NA(),100*VLOOKUP(G304,Employment!A:G,6,FALSE))","v":63.4},{"$f":"IF(K304=\"***\",0,IF(VLOOKUP(G304,Employment!A:G,7,FALSE)=\".\",\"#\",100*VLOOKUP(G304,Employment!A:G,7,FALSE)))","v":1.4000000000000001},{"$f":"VLOOKUP(G304,Employment!A:F,5,FALSE)","v":0},"2006/07",63.4,63.4,null,"","2007Scotland",{"$f":"IF(U304=\"***\",NA(),VLOOKUP(Q304,Employment!A:G,4,FALSE))","v":377600},{"$f":"IF(U304=\"***\",NA(),100*VLOOKUP(Q304,Employment!A:G,6,FALSE))","v":63.4},{"$f":"IF(U304=\"***\",0,IF(VLOOKUP(Q304,Employment!A:G,7,FALSE)=\".\",\"#\",100*VLOOKUP(Q304,Employment!A:G,7,FALSE)))","v":1.4000000000000001},{"$f":"VLOOKUP(Q304,Employment!A:F,5,FALSE)","v":0},null,{"$f":"IF(E262=\"Scotland\",NA(),IF(U304=\"***\",NA(),S304))","v":{"$error":"#N/A"}}]
[null,null,null,null,2008,null,"2008Scotland",{"$f":"IF(K305=\"***\",NA(),VLOOKUP(G305,Employment!A:G,4,FALSE))","v":375300},{"$f":"IF(K305=\"***\",NA(),100*VLOOKUP(G305,Employment!A:G,6,FALSE))","v":62.3},{"$f":"IF(K305=\"***\",0,IF(VLOOKUP(G305,Employment!A:G,7,FALSE)=\".\",\"#\",100*VLOOKUP(G305,Employment!A:G,7,FALSE)))","v":1.4000000000000001},{"$f":"VLOOKUP(G305,Employment!A:F,5,FALSE)","v":0},"2007/08",62.3,62.3,null,"","2008Scotland",{"$f":"IF(U305=\"***\",NA(),VLOOKUP(Q305,Employment!A:G,4,FALSE))","v":375300},{"$f":"IF(U305=\"***\",NA(),100*VLOOKUP(Q305,Employment!A:G,6,FALSE))","v":62.3},{"$f":"IF(U305=\"***\",0,IF(VLOOKUP(Q305,Employment!A:G,7,FALSE)=\".\",\"#\",100*VLOOKUP(Q305,Employment!A:G,7,FALSE)))","v":1.4000000000000001},{"$f":"VLOOKUP(Q305,Employment!A:F,5,FALSE)","v":0},null,{"$f":"IF(E262=\"Scotland\",NA(),IF(U305=\"***\",NA(),S305))","v":{"$error":"#N/A"}}]
[null,null,null,null,2009,null,"2009Scotland",{"$f":"IF(K306=\"***\",NA(),VLOOKUP(G306,Employment!A:G,4,FALSE))","v":364500},{"$f":"IF(K306=\"***\",NA(),100*VLOOKUP(G306,Employment!A:G,6,FALSE))","v":59.8},{"$f":"IF(K306=\"***\",0,IF(VLOOKUP(G306,Employment!A:G,7,FALSE)=\".\",\"#\",100*VLOOKUP(G306,Employment!A:G,7,FALSE)))","v":1.5},{"$f":"VLOOKUP(G306,Employment!A:F,5,FALSE)","v":0},"2008/09",59.8,59.8,null,"","2009Scotland",{"$f":"IF(U306=\"***\",NA(),VLOOKUP(Q306,Employment!A:G,4,FALSE))","v":364500},{"$f":"IF(U306=\"***\",NA(),100*VLOOKUP(Q306,Employment!A:G,6,FALSE))","v":59.8},{"$f":"IF(U306=\"***\",0,IF(VLOOKUP(Q306,Employment!A:G,7,FALSE)=\".\",\"#\",100*VLOOKUP(Q306,Employment!A:G,7,FALSE)))","v":1.5},{"$f":"VLOOKUP(Q306,Employment!A:F,5,FALSE)","v":0},null,{"$f":"IF(E262=\"Scotland\",NA(),IF(U306=\"***\",NA(),S306))","v":{"$error":"#N/A"}}]
[null,null,null,null,2010,null,"2010Scotland",{"$f":"IF(K307=\"***\",NA(),VLOOKUP(G307,Employment!A:G,4,FALSE))","v":340400},{"$f":"IF(K307=\"***\",NA(),100*VLOOKUP(G307,Employment!A:G,6,FALSE))","v":55.300000000000004},{"$f":"IF(K307=\"***\",0,IF(VLOOKUP(G307,Employment!A:G,7,FALSE)=\".\",\"#\",100*VLOOKUP(G307,Employment!A:G,7,FALSE)))","v":1.5},{"$f":"VLOOKUP(G307,Employment!A:F,5,FALSE)","v":0},"2009/10",55.300000000000004,55.300000000000004,null,"","2010Scotland",{"$f":"IF(U307=\"***\",NA(),VLOOKUP(Q307,Employment!A:G,4,FALSE))","v":340400},{"$f":"IF(U307=\"***\",NA(),100*VLOOKUP(Q307,Employment!A:G,6,FALSE))","v":55.300000000000004},{"$f":"IF(U307=\"***\",0,IF(VLOOKUP(Q307,Employment!A:G,7,FALSE)=\".\",\"#\",100*VLOOKUP(Q307,Employment!A:G,7,FALSE)))","v":1.5},{"$f":"VLOOKUP(Q307,Employment!A:F,5,FALSE)","v":0},null,{"$f":"IF(E262=\"Scotland\",NA(),IF(U307=\"***\",NA(),S307))","v":{"$error":"#N/A"}}]
[null,null,null,null,2011,null,"2011Scotland",{"$f":"IF(K308=\"***\",NA(),VLOOKUP(G308,Employment!A:G,4,FALSE))","v":344700},{"$f":"IF(K308=\"***\",NA(),100*VLOOKUP(G308,Employment!A:G,6,FALSE))","v":55.400000000000006},{"$f":"IF(K308=\"***\",0,IF(VLOOKUP(G308,Employment!A:G,7,FALSE)=\".\",\"#\",100*VLOOKUP(G308,Employment!A:G,7,FALSE)))","v":1.6},{"$f":"VLOOKUP(G308,Employment!A:F,5,FALSE)","v":0},"2010/11",55.400000000000006,55.400000000000006,null,"","2011Scotland",{"$f":"IF(U308=\"***\",NA(),VLOOKUP(Q308,Employment!A:G,4,FALSE))","v":344700},{"$f":"IF(U308=\"***\",NA(),100*VLOOKUP(Q308,Employment!A:G,6,FALSE))","v":55.400000000000006},{"$f":"IF(U308=\"***\",0,IF(VLOOKUP(Q308,Employment!A:G,7,FALSE)=\".\",\"#\",100*VLOOKUP(Q308,Employment!A:G,7,FALSE)))","v":1.6},{"$f":"VLOOKUP(Q308,Employment!A:F,5,FALSE)","v":0},null,{"$f":"IF(E262=\"Scotland\",NA(),IF(U308=\"***\",NA(),S308))","v":{"$error":"#N/A"}}]
[null,null,null,null,2012,null,"2012Scotland",{"$f":"IF(K309=\"***\",NA(),VLOOKUP(G309,Employment!A:G,4,FALSE))","v":333300},{"$f":"IF(K309=\"***\",NA(),100*VLOOKUP(G309,Employment!A:G,6,FALSE))","v":53.400000000000006},{"$f":"IF(K309=\"***\",0,IF(VLOOKUP(G309,Employment!A:G,7,FALSE)=\".\",\"#\",100*VLOOKUP(G309,Employment!A:G,7,FALSE)))","v":1.6},{"$f":"VLOOKUP(G309,Employment!A:F,5,FALSE)","v":0},"2011/12",53.400000000000006,53.400000000000006,null,"","2012Scotland",{"$f":"IF(U309=\"***\",NA(),VLOOKUP(Q309,Employment!A:G,4,FALSE))","v":333300},{"$f":"IF(U309=\"***\",NA(),100*VLOOKUP(Q309,Employment!A:G,6,FALSE))","v":53.400000000000006},{"$f":"IF(U309=\"***\",0,IF(VLOOKUP(Q309,Employment!A:G,7,FALSE)=\".\",\"#\",100*VLOOKUP(Q309,Employment!A:G,7,FALSE)))","v":1.6},{"$f":"VLOOKUP(Q309,Employment!A:F,5,FALSE)","v":0},null,{"$f":"IF(E262=\"Scotland\",NA(),IF(U309=\"***\",NA(),S309))","v":{"$error":"#N/A"}}]
[null,null,null,null,2013,null,"2013Scotland",{"$f":"IF(K310=\"***\",NA(),VLOOKUP(G310,Employment!A:G,4,FALSE))","v":330100},{"$f":"IF(K310=\"***\",NA(),100*VLOOKUP(G310,Employment!A:G,6,FALSE))","v":53.2},{"$f":"IF(K310=\"***\",0,IF(VLOOKUP(G310,Employment!A:G,7,FALSE)=\".\",\"#\",100*VLOOKUP(G310,Employment!A:G,7,FALSE)))","v":1.6},{"$f":"VLOOKUP(G310,Employment!A:F,5,FALSE)","v":0},"2012/13",53.2,53.2,null,"","2013Scotland",{"$f":"IF(U310=\"***\",NA(),VLOOKUP(Q310,Employment!A:G,4,FALSE))","v":330100},{"$f":"IF(U310=\"***\",NA(),100*VLOOKUP(Q310,Employment!A:G,6,FALSE))","v":53.2},{"$f":"IF(U310=\"***\",0,IF(VLOOKUP(Q310,Employment!A:G,7,FALSE)=\".\",\"#\",100*VLOOKUP(Q310,Employment!A:G,7,FALSE)))","v":1.6},{"$f":"VLOOKUP(Q310,Employment!A:F,5,FALSE)","v":0},null,{"$f":"IF(E262=\"Scotland\",NA(),IF(U310=\"***\",NA(),S310))","v":{"$error":"#N/A"}}]
[null,null,null,null,2014,null,"2014Scotland",{"$f":"IF(K311=\"***\",NA(),VLOOKUP(G311,Employment!A:G,4,FALSE))","v":321900},{"$f":"IF(K311=\"***\",NA(),100*VLOOKUP(G311,Employment!A:G,6,FALSE))","v":52.300000000000004},{"$f":"IF(K311=\"***\",0,IF(VLOOKUP(G311,Employment!A:G,7,FALSE)=\".\",\"#\",100*VLOOKUP(G311,Employment!A:G,7,FALSE)))","v":1.6},{"$f":"VLOOKUP(G311,Employment!A:F,5,FALSE)","v":0},"2013/14",52.300000000000004,52.300000000000004,null,"","2014Scotland",{"$f":"IF(U311=\"***\",NA(),VLOOKUP(Q311,Employment!A:G,4,FALSE))","v":321900},{"$f":"IF(U311=\"***\",NA(),100*VLOOKUP(Q311,Employment!A:G,6,FALSE))","v":52.300000000000004},{"$f":"IF(U311=\"***\",0,IF(VLOOKUP(Q311,Employment!A:G,7,FALSE)=\".\",\"#\",100*VLOOKUP(Q311,Employment!A:G,7,FALSE)))","v":1.6},{"$f":"VLOOKUP(Q311,Employment!A:F,5,FALSE)","v":0},null,{"$f":"IF(E262=\"Scotland\",NA(),IF(U311=\"***\",NA(),S311))","v":{"$error":"#N/A"}}]
[null,null,null,null,2015,null,"2015Scotland",{"$f":"IF(K312=\"***\",NA(),VLOOKUP(G312,Employment!A:G,4,FALSE))","v":336900},{"$f":"IF(K312=\"***\",NA(),100*VLOOKUP(G312,Employment!A:G,6,FALSE))","v":55.1},{"$f":"IF(K312=\"***\",0,IF(VLOOKUP(G312,Employment!A:G,7,FALSE)=\".\",\"#\",100*VLOOKUP(G312,Employment!A:G,7,FALSE)))","v":1.7000000000000002},{"$f":"VLOOKUP(G312,Employment!A:F,5,FALSE)","v":0},"2014/15",55.1,55.1,null,"","2015Scotland",{"$f":"IF(U312=\"***\",NA(),VLOOKUP(Q312,Employment!A:G,4,FALSE))","v":336900},{"$f":"IF(U312=\"***\",NA(),100*VLOOKUP(Q312,Employment!A:G,6,FALSE))","v":55.1},{"$f":"IF(U312=\"***\",0,IF(VLOOKUP(Q312,Employment!A:G,7,FALSE)=\".\",\"#\",100*VLOOKUP(Q312,Employment!A:G,7,FALSE)))","v":1.7000000000000002},{"$f":"VLOOKUP(Q312,Employment!A:F,5,FALSE)","v":0},null,{"$f":"IF(E262=\"Scotland\",NA(),IF(U312=\"***\",NA(),S312))","v":{"$error":"#N/A"}}]
[null,null,null,null,2016,null,"2016Scotland",{"$f":"IF(K313=\"***\",NA(),VLOOKUP(G313,Employment!A:G,4,FALSE))","v":339800},{"$f":"IF(K313=\"***\",NA(),100*VLOOKUP(G313,Employment!A:G,6,FALSE))","v":56.100000000000009},{"$f":"IF(K313=\"***\",0,IF(VLOOKUP(G313,Employment!A:G,7,FALSE)=\".\",\"#\",100*VLOOKUP(G313,Employment!A:G,7,FALSE)))","v":1.7999999999999998},{"$f":"VLOOKUP(G313,Employment!A:F,5,FALSE)","v":0},"2015/16",56.100000000000009,56.100000000000009,null,"","2016Scotland",{"$f":"IF(U313=\"***\",NA(),VLOOKUP(Q313,Employment!A:G,4,FALSE))","v":339800},{"$f":"IF(U313=\"***\",NA(),100*VLOOKUP(Q313,Employment!A:G,6,FALSE))","v":56.100000000000009},{"$f":"IF(U313=\"***\",0,IF(VLOOKUP(Q313,Employment!A:G,7,FALSE)=\".\",\"#\",100*VLOOKUP(Q313,Employment!A:G,7,FALSE)))","v":1.7999999999999998},{"$f":"VLOOKUP(Q313,Employment!A:F,5,FALSE)","v":0},null,{"$f":"IF(E262=\"Scotland\",NA(),IF(U313=\"***\",NA(),S313))","v":{"$error":"#N/A"}}]
[null,null,null,null,2017,null,"2017Scotland",{"$f":"IF(K314=\"***\",NA(),VLOOKUP(G314,Employment!A:G,4,FALSE))","v":343000},{"$f":"IF(K314=\"***\",NA(),100*VLOOKUP(G314,Employment!A:G,6,FALSE))","v":57.699999999999996},{"$f":"IF(K314=\"***\",0,IF(VLOOKUP(G314,Employment!A:G,7,FALSE)=\".\",\"#\",100*VLOOKUP(G314,Employment!A:G,7,FALSE)))","v":1.9},{"$f":"VLOOKUP(G314,Employment!A:F,5,FALSE)","v":0},"2016/17",57.699999999999996,57.699999999999996,null,"","2017Scotland",{"$f":"IF(U314=\"***\",NA(),VLOOKUP(Q314,Employment!A:G,4,FALSE))","v":343000},{"$f":"IF(U314=\"***\",NA(),100*VLOOKUP(Q314,Employment!A:G,6,FALSE))","v":57.699999999999996},{"$f":"IF(U314=\"***\",0,IF(VLOOKUP(Q314,Employment!A:G,7,FALSE)=\".\",\"#\",100*VLOOKUP(Q314,Employment!A:G,7,FALSE)))","v":1.9},{"$f":"VLOOKUP(Q314,Employment!A:F,5,FALSE)","v":0},null,{"$f":"IF(E262=\"Scotland\",NA(),IF(U314=\"***\",NA(),S314))","v":{"$error":"#N/A"}}]
[null,null,null,null,2018,null,"2018Scotland",{"$f":"IF(K315=\"***\",NA(),VLOOKUP(G315,Employment!A:G,4,FALSE))","v":342600},{"$f":"IF(K315=\"***\",NA(),100*VLOOKUP(G315,Employment!A:G,6,FALSE))","v":58.8},{"$f":"IF(K315=\"***\",0,IF(VLOOKUP(G315,Employment!A:G,7,FALSE)=\".\",\"#\",100*VLOOKUP(G315,Employment!A:G,7,FALSE)))","v":1.7999999999999998},{"$f":"VLOOKUP(G315,Employment!A:F,5,FALSE)","v":0},"2017/18",58.8,58.8,null,"","2018Scotland",{"$f":"IF(U315=\"***\",NA(),VLOOKUP(Q315,Employment!A:G,4,FALSE))","v":342600},{"$f":"IF(U315=\"***\",NA(),100*VLOOKUP(Q315,Employment!A:G,6,FALSE))","v":58.8},{"$f":"IF(U315=\"***\",0,IF(VLOOKUP(Q315,Employment!A:G,7,FALSE)=\".\",\"#\",100*VLOOKUP(Q315,Employment!A:G,7,FALSE)))","v":1.7999999999999998},{"$f":"VLOOKUP(Q315,Employment!A:F,5,FALSE)","v":0},null,{"$f":"IF(E262=\"Scotland\",NA(),IF(U315=\"***\",NA(),S315))","v":{"$error":"#N/A"}}]
[null,null,null,null,2019,null,"2019Scotland",{"$f":"IF(K316=\"***\",NA(),VLOOKUP(G316,Employment!A:G,4,FALSE))","v":337700},{"$f":"IF(K316=\"***\",NA(),100*VLOOKUP(G316,Employment!A:G,6,FALSE))","v":59.099999999999994},{"$f":"IF(K316=\"***\",0,IF(VLOOKUP(G316,Employment!A:G,7,FALSE)=\".\",\"#\",100*VLOOKUP(G316,Employment!A:G,7,FALSE)))","v":1.9},{"$f":"VLOOKUP(G316,Employment!A:F,5,FALSE)","v":0},"2018/19",59.099999999999994,59.099999999999994,null,"","2019Scotland",{"$f":"IF(U316=\"***\",NA(),VLOOKUP(Q316,Employment!A:G,4,FALSE))","v":337700},{"$f":"IF(U316=\"***\",NA(),100*VLOOKUP(Q316,Employment!A:G,6,FALSE))","v":59.099999999999994},{"$f":"IF(U316=\"***\",0,IF(VLOOKUP(Q316,Employment!A:G,7,FALSE)=\".\",\"#\",100*VLOOKUP(Q316,Employment!A:G,7,FALSE)))","v":1.9},{"$f":"VLOOKUP(Q316,Employment!A:F,5,FALSE)","v":0},null,{"$f":"IF(E262=\"Scotland\",NA(),IF(U316=\"***\",NA(),S316))","v":{"$error":"#N/A"}}]
[null,null,null,null,2020,null,"2020Scotland",{"$f":"IF(K317=\"***\",NA(),VLOOKUP(G317,Employment!A:G,4,FALSE))","v":298200},{"$f":"IF(K317=\"***\",NA(),100*VLOOKUP(G317,Employment!A:G,6,FALSE))","v":53.1},{"$f":"IF(K317=\"***\",0,IF(VLOOKUP(G317,Employment!A:G,7,FALSE)=\".\",\"#\",100*VLOOKUP(G317,Employment!A:G,7,FALSE)))","v":2.1},{"$f":"VLOOKUP(G317,Employment!A:F,5,FALSE)","v":0},"2019/20",53.1,53.1,null,"","2020Scotland",{"$f":"IF(U317=\"***\",NA(),VLOOKUP(Q317,Employment!A:G,4,FALSE))","v":298200},{"$f":"IF(U317=\"***\",NA(),100*VLOOKUP(Q317,Employment!A:G,6,FALSE))","v":53.1},{"$f":"IF(U317=\"***\",0,IF(VLOOKUP(Q317,Employment!A:G,7,FALSE)=\".\",\"#\",100*VLOOKUP(Q317,Employment!A:G,7,FALSE)))","v":2.1},{"$f":"VLOOKUP(Q317,Employment!A:F,5,FALSE)","v":0},null,{"$f":"IF(E262=\"Scotland\",NA(),IF(U317=\"***\",NA(),S317))","v":{"$error":"#N/A"}}]
[null,null,null,null,2021,null,{"$f":"E318&$E$262","v":"2021Scotland"},{"$f":"IF(K318=\"***\",NA(),VLOOKUP(G318,Employment!A:G,4,FALSE))","v":285700},{"$f":"IF(K318=\"***\",NA(),100*VLOOKUP(G318,Employment!A:G,6,FALSE))","v":51.800000000000004},{"$f":"IF(K318=\"***\",0,IF(VLOOKUP(G318,Employment!A:G,7,FALSE)=\".\",\"#\",100*VLOOKUP(G318,Employment!A:G,7,FALSE)))","v":2.6},{"$f":"VLOOKUP(G318,Employment!A:F,5,FALSE)","v":0},"2020/21",51.800000000000004,51.800000000000004,null,{"$f":"IF(K318=\"***\",100,\"\")","v":""},{"$f":"E318&\"Scotland\"","v":"2021Scotland"},{"$f":"IF(U318=\"***\",NA(),VLOOKUP(Q318,Employment!A:G,4,FALSE))","v":285700},{"$f":"IF(U318=\"***\",NA(),100*VLOOKUP(Q318,Employment!A:G,6,FALSE))","v":51.800000000000004},{"$f":"IF(U318=\"***\",0,IF(VLOOKUP(Q318,Employment!A:G,7,FALSE)=\".\",\"#\",100*VLOOKUP(Q318,Employment!A:G,7,FALSE)))","v":2.6},{"$f":"VLOOKUP(Q318,Employment!A:F,5,FALSE)","v":0},null,{"$f":"IF(E262=\"Scotland\",NA(),IF(U318=\"***\",NA(),S318))","v":{"$error":"#N/A"}}]
[]
[null,null,null,null,"Title"]
[null,null,null,null,"Area",{"$f":"\"3. Employment Rate for \"&E262&\" compared with \"&IF(E262=\"Scotland\",\"\",\"other \")&\"Local Authority areas, Jul 2020 - Jun 2021\"","v":"3. Employment Rate for Scotland compared with Local Authority areas, Jul 2020 - Jun 2021"}]
[null,null,null,null,"Time",{"$f":"IF($E$262=\"Scotland\",\"4. Employment Rate, \"&E262&\", \"&G331&\" to \"&G332,\"4. Employment Rate, \"&E262&\" and Scotland, \"&G331&\" to \"&G332)","v":"4. Employment Rate, Scotland, Jul 2004 - Jun 2005 to Jul 2020 - Jun 2021"}]
[null,null,null,null,"Table 1",{"$f":"\"E. Employment Rate for \"&E262&\" compared with \"&IF(E262=\"Scotland\",\"\",\"other \")&\"Local Authority areas, Jul 2020 - Jun 2021\"","v":"E. Employment Rate for Scotland compared with Local Authority areas, Jul 2020 - Jun 2021"}]
[null,null,null,null,"Table 2",{"$f":"IF($E$262=\"Scotland\",\"F. Employment Rate, \"&E262&\", \"&G331&\" to \"&G332,\"F. Employment Rate, \"&E262&\" and Scotland, \"&G331&\" to \"&G332)","v":"F. Employment Rate, Scotland, Jul 2004 - Jun 2005 to Jul 2020 - Jun 2021"}]
[]
[null,null,null,null,"Period","Jul 2020 - Jun 2021"]
[null,null,null,null,"Footnote"]
[null,null,null,null,{"$f":"\"Source: Annual Population Survey, \"&F326&\", ONS\"","v":"Source: Annual Population Survey, Jul 2020 - Jun 2021, ONS"}]
[]
[null,null,null,null,"Time X-Axis"]
[null,null,null,null,"Min Year",{"$f":"MIN(Employment!B:B)","v":2005},{"$f":"\"Jul \"&F331-1&\" - Jun \"&F331","v":"Jul 2004 - Jun 2005"}]
[null,null,null,null,"Max Year",{"$f":"MAX(Employment!B:B)","v":2021},{"$f":"\"Jul \"&F332-1&\" - Jun \"&F332","v":"Jul 2020 - Jun 2021"}]
[]
[null,null,null,null,"Text"]
[null,null,null,null,"Rank",{"$f":"VLOOKUP(E262,H265:M296,6,FALSE)","v":{"$error":"#N/A"}},{"$f":"VLOOKUP(E262,H265:M297,4,FALSE)","v":0},{"$f":"32-COUNTIF(AA265:AA296,\"***\")","v":30},{"$f":"33-COUNTIF(AA265:AA296,\"***\")","v":31},{"$f":"CEILING((33-COUNTIF(AA265:AA296,\"***\"))/2,1)","v":16}]
[null,null,null,null,{"$f":"IF(COUNTIF(W265:W297,VLOOKUP(E262,H265:M297,6,FALSE))>1,\"joint \",\"\")","v":""},{"$f":"IF(OR(F335=1,F335=H335),\"\",IF(F335<J335,F335,IF(AND(E336=\"joint \",H336=\"lowest \"),I335-F335-1,I335-F335)))","v":{"$error":"#N/A"}},{"$f":"IF(F336=\"\",\"\",IF(F336=2,\"nd \",IF(F336=3,\"rd \",\"th \")))","v":{"$error":"#N/A"}},{"$f":"IF(F335<J335,\"highest \",\"lowest \")","v":{"$error":"#N/A"}}]
[null,null,null,null,{"$f":"E336&F336&G336&H336","v":{"$error":"#N/A"}}]
[null,null,null,null,{"$f":"IF(G335=\"***\",\"Estimates for \"&E262&\" are considered unreliable for practical purposes.\",IF($E$262=\"Scotland\",\"\",E262&\" has the \"&E337&\"employment rate in Scotland\"))","v":""}]
[]
[null,null,null,null,"Parahraph Text"]
[null,null,null,null,{"$f":"IF(N318<W318,\"lower than\",IF(N318>W318,\"higher than\",\"the same as\"))","v":{"$error":"#N/A"}}]
[null,null,null,null,{"$f":"IF($E$262=\"Scotland\",\"Data for the period \"&F326&\" shows that the employment rate for 16 to 24 year olds in \"&E262&\" was \"&N318&\" per cent.\",\"Data for the period \"&F326&\" shows that the employment rate for 16 to 24 year olds in \"&E262&\" was \"&E341&\" that of Scotland (\"&TEXT(N318, \"0.0\")&\" per cent vs \"&TEXT(W318, \"0.0\")&\" per cent).\")","v":"Data for the period Jul 2020 - Jun 2021 shows that the employment rate for 16 to 24 year olds in Scotland was 51.8 per cent."}]
[null,null,null,null,{"$f":"IF(K318=\"***\",\"Data for the period \"&F326&\" is considered unreliable for comparing the unemployment rate between \"&E262&\" and Scotland\",E342 )","v":"Data for the period Jul 2020 - Jun 2021 shows that the employment rate for 16 to 24 year olds in Scotland was 51.8 per cent."}]

{"sheet":"Claimant Count","index":5,"n_rows":82,"n_cols":19,"rows_kept":82,"cut":false,"hidden":true,"merged":[[47,0,47,1],[6,0,6,1]]}
["Claimant count by sex and age"]
["ONS Crown Copyright Reserved [from Nomis]"]
[]
["gender","Total"]
["age","Aged 16-24"]
["measure","Claimant count"]
["Levels"]
["local authority: district / unitary","2019-10-01","2020-10-01","2020-11-01","2020-12-01","2021-01-01","2021-02-01","2021-03-01","2021-04-01","2021-05-01","2021-06-01","2021-07-01","2021-08-01","2021-09-01","2021-10-01",null,null,"Population\n2019","Population\nCurrent"]
["Aberdeen City",725,1725,1670,1650,1680,1695,1735,1680,1575,1495,1450,1330,1235,1140,null,"Aberdeen City",26964,26343]
["Aberdeenshire",670,1260,1225,1210,1270,1305,1330,1320,1220,1145,1115,1040,915,855,null,"Aberdeenshire",22752,22420]
["Angus",465,785,780,765,775,790,775,755,705,660,660,660,605,545,null,"Angus",10717,10612]
["Argyll and Bute",210,485,495,480,465,495,495,485,435,415,385,360,325,325,null,"Argyll and Bute",8181,8121]
["City of Edinburgh",1005,2915,2940,2850,2785,2915,2925,2915,2650,2380,2290,2120,1830,1705,null,"City of Edinburgh",64964,64473]
["Clackmannanshire",325,510,475,480,460,455,460,455,435,375,355,355,310,280,null,"Clackmannanshire",5097,4965]
["Dumfries and Galloway",550,860,855,840,840,855,870,835,755,670,645,615,545,525,null,"Dumfries and Galloway",13169,12791]
["Dundee City",970,1550,1495,1440,1435,1495,1495,1450,1390,1325,1385,1335,1165,1040,null,"Dundee City",20881,20568]
["East Ayrshire",755,1185,1175,1135,1170,1175,1165,1155,1075,1000,975,945,840,780,null,"East Ayrshire",11779,11548]
["East Dunbartonshire",235,565,505,500,455,485,490,445,415,390,400,365,340,315,null,"East Dunbartonshire",10263,10112]
["East Lothian",290,630,625,620,650,710,705,685,620,545,520,495,440,410,null,"East Lothian",9729,9559]
["East Renfrewshire",185,475,445,440,435,430,425,410,370,345,340,300,270,240,null,"East Renfrewshire",9562,9583]
["Falkirk",680,1230,1255,1240,1230,1235,1255,1245,1135,1075,1030,965,860,835,null,"Falkirk",15575,15413]
["Fife",1765,3085,2945,2830,2880,3005,3065,2995,2860,2695,2630,2505,2160,2015,null,"Fife",40061,39787]
["Glasgow City",3250,6515,6435,6235,6040,6130,6210,6085,5745,5415,5355,5145,4530,4250,null,"Glasgow City",79760,78893]
["Highland",585,1440,1380,1360,1385,1430,1485,1435,1280,1145,985,880,745,690,null,"Highland",21239,20937]
["Inverclyde",465,615,585,540,515,545,570,620,565,510,545,520,440,425,null,"Inverclyde",7607,7420]
["Midlothian",310,650,660,670,645,655,680,650,610,570,515,480,385,365,null,"Midlothian",8547,8494]
["Moray",290,545,535,535,570,650,660,595,565,515,480,445,390,370,null,"Moray",9272,9019]
["Na h-Eileanan Siar",45,130,115,115,120,125,120,120,105,90,80,80,60,60,null,"Na h-Eileanan Siar",2083,2087]
["North Ayrshire",860,1385,1370,1365,1325,1380,1390,1340,1235,1115,1130,1070,900,855,null,"North Ayrshire",13456,13130]
["North Lanarkshire",1595,2990,2885,2800,2750,2850,2900,2815,2610,2415,2445,2280,2020,1855,null,"North Lanarkshire",35916,35816]
["Orkney Islands",40,75,80,80,80,80,95,90,75,65,55,50,55,55,null,"Orkney Islands",1847,1793]
["Perth and Kinross",355,865,855,830,835,850,860,840,745,695,670,650,550,480,null,"Perth and Kinross",13744,13644]
["Renfrewshire",700,1395,1350,1330,1320,1350,1385,1340,1215,1080,1105,1010,840,770,null,"Renfrewshire",18058,17820]
["Scottish Borders",370,790,780,775,780,805,780,770,695,660,615,585,520,475,null,"Scottish Borders",10111,10030]
["Shetland Islands",55,105,100,100,105,100,105,105,85,85,80,75,65,75,null,"Shetland Islands",2082,2068]
["South Ayrshire",525,960,915,945,950,960,965,940,855,775,730,665,555,520,null,"South Ayrshire",10302,10118]
["South Lanarkshire",1305,2495,2365,2315,2260,2290,2390,2315,2145,1965,1925,1835,1580,1455,null,"South Lanarkshire",30800,30514]
["Stirling",295,575,545,555,560,570,590,580,510,470,435,395,365,335,null,"Stirling",12313,12156]
["West Dunbartonshire",510,905,880,870,875,870,875,870,835,765,730,700,650,585,null,"West Dunbartonshire",8712,8540]
["West Lothian",720,1400,1350,1320,1320,1365,1435,1430,1305,1210,1150,1060,950,850,null,"West Lothian",18179,18108]
["Scotland",21095,41090,40065,39220,38965,40050,40665,39760,36820,34060,33215,31315,27445,25480,null,"Scotland",573722,566882]
[]
["This datas may be affected by a geographical definition issue. For further information see https://www.nomisweb.co.uk/articles/1199.aspx."]
["Under Universal Credit a broader span of claimants are required to look for work than under Jobseeker's Allowance. As Universal Credit Full Service is rolled out in particular areas, the number of people recorded as being on the Claimant Count is therefore likely to rise."]
["This dataset only includes claimant records with information to sufficiently classify them within the dataset. Totals from this dataset may not tally with the total number of claim records shown elsewhere as a small number of records do not have this information."]
["All data are rounded to the nearest 5 and may not precisely add to the sum of the number of people claiming JSA, published on Nomis, and the number of people claiming Universal Credit required to seek work, published by DWP, due to independent rounding."]
[]
["Rates"]
["local authority: district / unitary",{"$f":"B8","v":"2019-10-01"},{"$f":"C8","v":"2020-10-01"},{"$f":"D8","v":"2020-11-01"},"2020-12-01","2021-01-01","2021-02-01","2021-03-01","2021-04-01","2021-05-01","2021-06-01","2021-07-01","2021-08-01","2021-09-01","2021-10-01",null,"Rank"]
["Aberdeen City",{"$f":"100*B9/$R9","v":2.6887702121346981},{"$f":"100*C9/$S9","v":6.5482291310784646},{"$f":"100*D9/$S9","v":6.3394450138556735},6.2635235166837493,6.3774057624416356,6.4343468853205783,6.5861898796644267,6.3774057624416356,5.9788179022890331,5.6751319136013363,5.5043085449645064,5.0487795619329612,4.6881524503663217,4.3275253387996813,null,{"$f":"_xlfn.RANK.EQ(O50,$O$50:$O$81)+COUNTIF($O$50:O50,O50)-1","v":16}]
["Aberdeenshire",{"$f":"100*B10/$R10","v":2.9447960618846696},{"$f":"100*C10/$S10","v":5.6199821587867973},5.4638715432649416,5.3969669937555755,5.6645851917930417,5.8206958073148973,5.9322033898305087,5.8876003568242643,5.4415700267618199,5.1070472792149868,4.9732381801962537,4.6387154326494198,4.0811775200713649,3.8135593220338984,null,{"$f":"_xlfn.RANK.EQ(O51,$O$50:$O$81)+COUNTIF($O$50:O51,O51)-1","v":23}]
["Angus",{"$f":"100*B11/$R11","v":4.3389008117943453},7.3972860912174898,7.3501696192989066,7.2088202035431586,7.3030531473803242,7.4444025631360722,7.3030531473803242,7.1145872597059929,6.6434225405201657,6.2193742932529208,6.2193742932529208,6.2193742932529208,5.7010931021485112,5.1356954391255183,null,{"$f":"_xlfn.RANK.EQ(O52,$O$50:$O$81)+COUNTIF($O$50:O52,O52)-1","v":10}]
["Argyll and Bute",{"$f":"100*B12/$R12","v":2.5669233590025669},5.9721709149119571,6.095308459549317,5.9106021425932767,5.7258958256372372,6.095308459549317,6.095308459549317,5.9721709149119571,5.3564831917251574,5.1102081024504376,4.7407954685383578,4.4329516069449575,4.0019702007141982,4.0019702007141982,null,{"$f":"_xlfn.RANK.EQ(O53,$O$50:$O$81)+COUNTIF($O$50:O53,O53)-1","v":22}]
["City of Edinburgh",{"$f":"100*B13/$R13","v":1.547010652053445},4.5212724706466272,4.5600483923502866,4.4204550742171138,4.3196376777876013,4.5212724706466272,4.5367828393280911,4.5212724706466272,4.1102477005878431,3.691467746188327,3.5518744280551551,3.2881981604702744,2.8383974687078313,2.6445178601895365,null,{"$f":"_xlfn.RANK.EQ(O54,$O$50:$O$81)+COUNTIF($O$50:O54,O54)-1","v":31}]
["Clackmannanshire",{"$f":"100*B14/$R14","v":6.3762997841867763},10.271903323262841,9.5669687814702922,9.667673716012084,9.2648539778449148,9.1641490433031212,9.2648539778449148,9.1641490433031212,8.761329305135952,7.5528700906344408,7.1500503524672707,7.1500503524672707,6.2437059415911378,5.6394763343403831,null,{"$f":"_xlfn.RANK.EQ(O55,$O$50:$O$81)+COUNTIF($O$50:O55,O55)-1","v":5}]
["Dumfries and Galloway",{"$f":"100*B15/$R15","v":4.176475055053535},6.7234774450785713,6.6843874599327648,6.5671175044953483,6.5671175044953483,6.6843874599327648,6.8016574153701823,6.5280275193495427,5.9025877570166525,5.2380580095379567,5.0426080838089282,4.8080681729340942,4.260808380892815,4.1044484403095929,null,{"$f":"_xlfn.RANK.EQ(O56,$O$50:$O$81)+COUNTIF($O$50:O56,O56)-1","v":20}]
["Dundee City",{"$f":"100*B16/$R16","v":4.6453713902590872},7.5359782185919872,7.2685725398677556,7.001166861143524,6.9768572539867755,7.2685725398677556,7.2685725398677556,7.0497860754570203,6.7580707895760401,6.4420458965383123,6.7337611824192924,6.4906651108518085,5.6641384675223652,5.0563982886036563,null,{"$f":"_xlfn.RANK.EQ(O57,$O$50:$O$81)+COUNTIF($O$50:O57,O57)-1","v":12}]
["East Ayrshire",{"$f":"100*B17/$R17","v":6.4097121996773918},10.261517145826117,10.17492206442674,9.8285417388292338,10.131624523727051,10.17492206442674,10.088326983027365,10.001731901627988,9.3089712504329754,8.6595081399376514,8.4430204364392107,8.1832351922410815,7.2739868375476275,6.7544163491513682,null,{"$f":"_xlfn.RANK.EQ(O58,$O$50:$O$81)+COUNTIF($O$50:O58,O58)-1","v":2}]
["East Dunbartonshire",{"$f":"100*B18/$R18","v":2.2897788171100069},5.5874208860759493,4.9940664556962027,4.9446202531645573,4.4996044303797467,4.7962816455696204,4.8457278481012658,4.400712025316456,4.1040348101265822,3.8568037974683542,3.9556962025316458,3.6095727848101267,3.3623417721518987,3.1151107594936707,null,{"$f":"_xlfn.RANK.EQ(O59,$O$50:$O$81)+COUNTIF($O$50:O59,O59)-1","v":27}]
["East Lothian",{"$f":"100*B19/$R19","v":2.9807791139891049},6.590647557275866,6.5383408306308191,6.486034103985773,6.7998744638560522,7.4275551835966107,7.3752484569515637,7.1660215503713776,6.486034103985773,5.7014332043100744,5.4398995710848412,5.178365937859609,4.6029919447640966,4.2891515848938173,null,{"$f":"_xlfn.RANK.EQ(O60,$O$50:$O$81)+COUNTIF($O$50:O60,O60)-1","v":19}]
["East Renfrewshire",{"$f":"100*B20/$R20","v":1.9347416858397826},4.9566941458833353,4.6436397787749142,4.5914640509235101,4.5392883230721068,4.4871125952207036,4.4349368673692995,4.2784096838150889,3.8610038610038608,3.6001252217468434,3.5479494938954397,3.1305436710842116,2.8174893039757904,2.5044349368673693,null,{"$f":"_xlfn.RANK.EQ(O61,$O$50:$O$81)+COUNTIF($O$50:O61,O61)-1","v":32}]
["Falkirk",{"$f":"100*B21/$R21","v":4.3659711075441416},7.9802763900603386,8.1424771296957115,8.0451566859144883,7.9802763900603386,8.0127165379874139,8.1424771296957115,8.0775968338415627,7.3639135794459225,6.974631804321028,6.6826704729773567,6.2609485499253879,5.5797054434568221,5.4175047038214492,null,{"$f":"_xlfn.RANK.EQ(O62,$O$50:$O$81)+COUNTIF($O$50:O62,O62)-1","v":6}]
["Fife",{"$f":"100*B22/$R22","v":4.4057811836948657},7.7537889260311159,7.4019151984316487,7.1128760650463718,7.2385452534747534,7.5527182245457061,7.7035212506597635,7.5275843868600294,7.188277578103401,6.7735692562897425,6.6101993113328472,6.2960263402618946,5.4289089401060648,5.0644682936637597,null,{"$f":"_xlfn.RANK.EQ(O63,$O$50:$O$81)+COUNTIF($O$50:O63,O63)-1","v":11}]
["Glasgow City",{"$f":"100*B23/$R23","v":4.0747241725175529},8.2580203566856376,8.1566171903717688,7.9031092745870986,7.6559390566970453,7.7700176188001473,7.8714207851140152,7.7129783377485959,7.282014880914657,6.8637268198699504,6.7876744451345497,6.5214911335606454,5.7419542925227844,5.3870432104242454,null,{"$f":"_xlfn.RANK.EQ(O64,$O$50:$O$81)+COUNTIF($O$50:O64,O64)-1","v":7}]
["Highland",{"$f":"100*B24/$R24","v":2.7543669664296813},6.8777761856999566,6.591202177962459,6.4956775087166259,6.6150833452739173,6.830013851077041,7.0927066915030803,6.8538950183884992,6.1135788317332951,5.4687873143239241,4.7045899603572625,4.2030854468166403,3.5582939294072693,3.2956010889812295,null,{"$f":"_xlfn.RANK.EQ(O65,$O$50:$O$81)+COUNTIF($O$50:O65,O65)-1","v":26}]
["Inverclyde",{"$f":"100*B25/$R25","v":6.112790850532404},8.2884097035040423,7.8840970350404316,7.2776280323450138,6.940700808625337,7.3450134770889486,7.6819407008086253,8.355795148247978,7.6145552560646896,6.8733153638814013,7.3450134770889486,7.0080862533692718,5.9299191374663076,5.7277628032345014,null,{"$f":"_xlfn.RANK.EQ(O66,$O$50:$O$81)+COUNTIF($O$50:O66,O66)-1","v":4}]
["Midlothian",{"$f":"100*B26/$R26","v":3.627003627003627},7.6524605603955731,7.7701907228631972,7.8879208853308214,7.5935954791617615,7.7113256416293856,8.0056510477984464,7.6524605603955731,7.1815399105250766,6.71061926065458,6.0631033670826469,5.6510477984459619,4.5326112550035322,4.2971509300682831,null,{"$f":"_xlfn.RANK.EQ(O67,$O$50:$O$81)+COUNTIF($O$50:O67,O67)-1","v":18}]
["Moray",{"$f":"100*B27/$R27","v":3.1276962899050904},6.0427985364231072,5.9319214990575455,5.9319214990575455,6.3199911298370104,7.2070074287615036,7.3178844661270652,6.5971837232509145,6.2645526111542296,5.7101674243264222,5.3220977935469564,4.9340281627674907,4.3242044572569025,4.1024503825257792,null,{"$f":"_xlfn.RANK.EQ(O68,$O$50:$O$81)+COUNTIF($O$50:O68,O68)-1","v":21}]
["Na h-Eileanan Siar",{"$f":"100*B28/$R28","v":2.1603456553048486},6.2290368950646862,5.5103018687110685,5.5103018687110685,5.7498802108289411,5.9894585529468136,5.7498802108289411,5.7498802108289411,5.0311451844753234,{"$f":"100*K28/$S28","v":4.3124101581217058},3.8332534738859607,3.8332534738859607,2.8749401054144705,2.8749401054144705,null,{"$f":"_xlfn.RANK.EQ(O69,$O$50:$O$81)+COUNTIF($O$50:O69,O69)-1","v":29}]
["North Ayrshire",{"$f":"100*B29/$R29","v":6.3912009512485133},10.548362528560549,10.434120335110434,10.396039603960396,10.091393754760091,10.51028179741051,10.586443259710586,10.205635948210206,9.4059405940594054,8.4920030464584926,8.6062452399086062,8.1492764661081498,6.8545316070068543,6.5118050266565115,null,{"$f":"_xlfn.RANK.EQ(O70,$O$50:$O$81)+COUNTIF($O$50:O70,O70)-1","v":3}]
["North Lanarkshire",{"$f":"100*B30/$R30","v":4.4409176968482011},8.3482242573151666,8.0550591914228278,7.8177350904623628,7.6781326781326777,7.9573375027920479,8.0969399151217338,7.8596158141612689,7.2872459236095599,6.7427965155237883,6.8265579629215996,6.3658700022336383,5.6399374581192765,5.1792494974313152,null,{"$f":"_xlfn.RANK.EQ(O71,$O$50:$O$81)+COUNTIF($O$50:O71,O71)-1","v":8}]
["Orkney Islands",{"$f":"100*B31/$R31","v":2.1656740660530591},4.1829336307863914,4.4617958728388176,4.4617958728388176,4.4617958728388176,4.4617958728388176,5.2983825989960955,5.0195203569436702,4.1829336307863914,3.6252091466815393,3.0674846625766872,2.7886224205242609,3.0674846625766872,3.0674846625766872,null,{"$f":"_xlfn.RANK.EQ(O72,$O$50:$O$81)+COUNTIF($O$50:O72,O72)-1","v":28}]
["Perth and Kinross",{"$f":"100*B32/$R32","v":2.5829452852153669},6.3397830548226324,6.2664907651715041,6.0832600410436823,6.1199061858692465,6.2298446203459399,6.3031369099970682,6.1565523306948107,5.460275579009088,5.0938141307534446,4.9105834066256229,4.7639988273233653,4.0310759308120785,3.5180299032541775,null,{"$f":"_xlfn.RANK.EQ(O73,$O$50:$O$81)+COUNTIF($O$50:O73,O73)-1","v":25}]
["Renfrewshire",{"$f":"100*B33/$R33","v":3.8763982722339128},7.8282828282828278,7.5757575757575761,7.4635241301907973,7.4074074074074074,7.5757575757575761,7.7721661054994389,7.5196408529741863,6.8181818181818183,6.0606060606060606,6.2008978675645343,5.6677890011223342,4.7138047138047137,4.3209876543209873,null,{"$f":"_xlfn.RANK.EQ(O74,$O$50:$O$81)+COUNTIF($O$50:O74,O74)-1","v":17}]
["Scottish Borders",{"$f":"100*B34/$R34","v":3.659380872317278},7.8763708873379858,7.7766699900299106,7.726819541375872,7.7766699900299106,8.0259222333001006,7.7766699900299106,7.6769690927218344,6.9292123629112661,6.5802592223330008,6.1316051844466601,5.8325024925224325,5.1844466600199404,4.7357926221335989,null,{"$f":"_xlfn.RANK.EQ(O75,$O$50:$O$81)+COUNTIF($O$50:O75,O75)-1","v":14}]
["Shetland Islands",{"$f":"100*B35/$R35","v":2.6416906820365034},5.0773694390715667,4.8355899419729207,4.8355899419729207,5.0773694390715667,4.8355899419729207,5.0773694390715667,5.0773694390715667,4.1102514506769827,4.1102514506769827,3.8684719535783367,3.6266924564796907,3.1431334622823983,3.6266924564796907,null,{"$f":"_xlfn.RANK.EQ(O76,$O$50:$O$81)+COUNTIF($O$50:O76,O76)-1","v":24}]
["South Ayrshire",{"$f":"100*B36/$R36","v":5.0960978450786252},9.4880411148448314,9.0432891875864794,9.3397904724253813,9.3892073532318641,9.4880411148448314,9.5374579956513141,9.2903735916188968,8.4502866179086773,7.6596165250049415,7.2148645977465904,6.5724451472623047,5.4852737695196678,5.1393556038742831,null,{"$f":"_xlfn.RANK.EQ(O77,$O$50:$O$81)+COUNTIF($O$50:O77,O77)-1","v":9}]
["South Lanarkshire",{"$f":"100*B37/$R37","v":4.2370129870129869},8.1765746870289053,7.7505407354001443,7.586681523235236,7.4064363898538375,7.5047519171527819,7.8324703414825985,7.586681523235236,7.0295602018745491,6.4396670380808807,6.3085796683489548,6.0136330864521206,5.1779511044110897,4.7683030739988199,null,{"$f":"_xlfn.RANK.EQ(O78,$O$50:$O$81)+COUNTIF($O$50:O78,O78)-1","v":13}]
["Stirling",{"$f":"100*B38/$R38","v":2.3958417932266709},4.730174399473511,4.4833826916748931,4.5656465942744324,4.6067785455742021,4.6890424481737414,4.85357025337282,4.7713063507732807,4.1954590325765055,3.8664034221783483,3.5784797630799603,3.2494241526818031,3.0026324448831851,2.7558407370845672,null,{"$f":"_xlfn.RANK.EQ(O79,$O$50:$O$81)+COUNTIF($O$50:O79,O79)-1","v":30}]
["West Dunbartonshire",{"$f":"100*B39/$R39","v":5.8539944903581267},10.597189695550352,10.304449648711945,10.187353629976581,10.245901639344263,10.187353629976581,10.245901639344263,10.187353629976581,9.7775175644028103,8.9578454332552688,8.5480093676814981,8.1967213114754092,7.6112412177985949,6.8501170960187352,null,{"$f":"_xlfn.RANK.EQ(O80,$O$50:$O$81)+COUNTIF($O$50:O80,O80)-1","v":1}]
["West Lothian",{"$f":"100*B40/$R40","v":3.9606138951537488},7.7313894411309922,7.4552683896620282,7.2895957587806492,7.2895957587806492,7.5381047051027172,7.9246741771592664,7.8970620720123703,7.2067594433399602,6.6821294455489291,6.350784183786172,5.8537662911420369,5.2462999779103159,4.6940578749723878,null,{"$f":"_xlfn.RANK.EQ(O81,$O$50:$O$81)+COUNTIF($O$50:O81,O81)-1","v":15}]
["Scotland",{"$f":"100*B41/$R41","v":3.6768678907205929},7.2484220702015589,7.0676084264450099,6.9185474225676593,6.8735645160721281,7.0649623731217428,7.1734505593756728,7.0138053422052558,6.4951788908450085,6.008305079363959,5.8592440754866093,5.5240773212061773,4.8413955638034016,4.4947625784554814]

{"sheet":"Participation","index":6,"n_rows":68,"n_cols":7,"rows_kept":68,"cut":false,"hidden":true,"merged":[]}
[null,null,null,"Participating Status Grouped"]
["Year","Local Authority","Total Cohort (16-19)","Participating (16-19)","Participating in Education \n(16-19)","Participating in Employment (16-19)","Participating in Other Training & Development (16-19)"]
[2021,"Aberdeen City",6375,89.443137254901956,74.807843137254906,13.003921568627453,1.6313725490196078]
[2021,"Aberdeenshire",10608,92.213423831070898,75.377073906485663,15.789969834087481,1.0463800904977374]
[2021,"Angus",4792,92.445742904841396,75.521702838063447,15.630217028380637,1.2938230383973288]
[2021,"Argyll and Bute",3168,93.529040404040416,70.549242424242422,21.875,1.1047979797979799]
[2021,"Clackmannanshire",1943,89.963973237261968,67.370046320123521,18.373648996397325,4.2202779207411218]
[2021,"Dumfries and Galloway",5830,93.104631217838758,73.464837049742712,18.490566037735849,1.1492281303602059]
[2021,"Dundee City",5529,89.907759088442745,73.376740821124969,13.619099294628324,2.9119189726894557]
[2021,"East Ayrshire",4956,91.000807102502009,76.170298627925746,12.570621468926554,2.2598870056497176]
[2021,"East Dunbartonshire",5086,96.657491152182459,86.905230043255997,8.8084939048368067,0.94376720408965786]
[2021,"East Lothian",4160,94.01442307692308,71.634615384615387,20.048076923076923,2.3317307692307692]
[2021,"East Renfrewshire",5206,97.195543603534389,88.359585094122167,8.0291970802919703,0.80676142912024584]
[2021,"City of Edinburgh",13468,92.523017523017529,76.128601128601119,14.56786456786457,1.8265518265518266]
[2021,"Na h-Eileanan Siar",1052,95.627376425855516,70.152091254752847,22.908745247148289,2.5665399239543727]
[2021,"Falkirk",6431,91.820867672212728,71.730679521069817,17.944332141191104,2.145856009951796]
[2021,"Fife",14995,91.030343447815937,73.091030343447812,16.112037345781928,1.8272757585861954]
[2021,"Glasgow City",20073,90.544512529268175,75.344990783639716,12.524286354804962,2.6752353908234943]
[2021,"Highland",9570,92.643678160919535,70.323928944618601,20.585161964472309,1.7345872518286312]
[2021,"Inverclyde",3051,93.313667649950844,81.153720091773181,10.783349721402818,1.3765978367748279]
[2021,"Midlothian",3690,93.71273712737127,67.696476964769644,24.444444444444443,1.5718157181571817]
[2021,"Moray",3572,91.769316909294517,70.10078387458006,20.016797312430011,1.6517357222844344]
[2021,"North Ayrshire",5730,90.122164048865613,75.322862129144852,13.246073298429319,1.5532286212914486]
[2021,"North Lanarkshire",15194,91.457154139792024,73.456627616164269,16.348558641569042,1.6519678820587074]
[2021,"Orkney Islands",829,93.365500603136311,67.792521109770803,24.607961399276238,0.96501809408926409]
[2021,"Perth and Kinross",5454,93.601026769343605,75.925925925925924,16.116611661166118,1.5584891822515585]
[2021,"Renfrewshire",7126,92.997474038731411,78.304799326410318,13.415660959865283,1.2770137524557956]
[2021,"Scottish Borders",4677,93.799444088090652,74.107333760957886,18.302330553773789,1.3897797733589907]
[2021,"Shetland Islands",983,97.049847405900309,70.396744659206519,22.990844354018311,3.6622583926754833]
[2021,"South Ayrshire",4360,91.788990825688074,76.284403669724767,12.614678899082568,2.8899082568807342]
[2021,"South Lanarkshire",13530,92.793791574279382,75.388026607538805,15.003695491500368,2.4020694752402072]
[2021,"Stirling",4041,93.714427121999506,77.282850779510028,14.971541697599605,1.4600346448898789]
[2021,"West Dunbartonshire",3814,90.797063450445719,73.07288935500786,15.783953854221288,1.9402202412165706]
[2021,"West Lothian",8236,91.282175813501695,72.073822243807669,17.265662943176299,1.9426906265177271]
[2021,"Scotland",207529,92.179406251656388,74.798702831893365,15.53180519349103,1.8488982262719909]
[2020,"Aberdeen City",6378,89.8714330511132,72.185638131075564,16.337409846346816,1.3483850736908121]
[2020,"Aberdeenshire",10567,92.287309548594692,72.925144317213963,18.321188606037666,1.040976625343049]
[2020,"Angus",4762,91.432171356572866,73.141537169256608,17.114657706845861,1.1759764804703907]
[2020,"Argyll and Bute",3185,94.065934065934059,70.298273155416013,22.637362637362639,1.1302982731554161]
[2020,"Clackmannanshire",1949,89.327860441251929,64.956387891226271,21.652129297075422,2.7193432529502308]
[2020,"Dumfries and Galloway",5728,91.899441340782118,69.308659217877107,20.757681564245811,1.8331005586592179]
[2020,"Dundee City",5397,90.03149898091533,69.890680007411518,17.009449694274597,3.1313692792292014]
[2020,"East Ayrshire",4909,89.977592177632914,72.356895498064773,15.196577714402117,2.4241189651660213]
[2020,"East Dunbartonshire",5036,96.147736298649718,84.47180301826846,10.663224781572676,1.0127084988085784]
[2020,"East Lothian",4082,94.46349828515433,68.299853013228812,23.395394414502697,2.7682508574228319]
[2020,"East Renfrewshire",5107,96.749559428235756,87.135304484041512,8.7918543176032902,0.82240062659095359]
[2020,"City of Edinburgh",13390,92.397311426437639,72.770724421209849,17.408513816280806,2.2180731889469754]
[2020,"Na h-Eileanan Siar",1068,95.50561797752809,69.850187265917612,23.689138576779026,1.9662921348314606]
[2020,"Falkirk",6375,91.921568627450981,68.8,21.349019607843136,1.7725490196078431]
[2020,"Fife",14728,91.723248234655074,70.783541553503525,18.841662140141228,2.0980445410103203]
[2020,"Glasgow City",19930,89.51831409934772,71.806322127446066,15.539387857501255,2.1726041144004014]
[2020,"Highland",9622,93.587611723134472,67.584701725213066,23.591768863022242,2.4111411348991894]
[2020,"Inverclyde",3037,92.920645373724071,78.860717813631879,12.742838327296674,1.3170892327955219]
[2020,"Midlothian",3708,93.36569579288026,61.67745415318231,30.231930960086302,1.4563106796116505]
[2020,"Moray",3592,93.485523385300667,67.900890868596889,23.997772828507795,1.5868596881959911]
[2020,"North Ayrshire",5711,90.56207319208545,73.997548590439493,14.97110838732271,1.5934162143232358]
[2020,"North Lanarkshire",15139,90.712728713917699,70.546271220027748,18.779311711473678,1.3871457824162758]
[2020,"Orkney Islands",831,94.705174488567991,66.185318892900128,27.3164861612515,1.2033694344163659]
[2020,"Perth and Kinross",5458,94.759985342616332,71.692927812385491,21.088310736533529,1.9787467936973249]
[2020,"Renfrewshire",7144,92.371220604703254,74.776035834266523,16.251399776035836,1.3437849944008957]
[2020,"Scottish Borders",4622,94.547814798788394,72.046733016010393,21.029857204673302,1.4712245781047164]
[2020,"Shetland Islands",977,96.827021494370527,66.632548618219033,27.635619242579324,2.5588536335721597]
[2020,"South Ayrshire",4402,91.367560199909136,74.829622898682416,14.425261244888688,2.112676056338028]
[2020,"South Lanarkshire",13416,92.702742993440665,72.734048896839596,17.471675611210493,2.4970184853905786]
[2020,"Stirling",3991,94.387371586068653,75.043848659483842,17.439238286143823,1.9042846404409921]
[2020,"West Dunbartonshire",3707,90.207715133531153,70.65012139196115,17.750202319935259,1.8073914216347451]
[2020,"West Lothian",8033,92.406323913855346,70.670982198431474,20.054774057014811,1.6805676584090625]
[2020,"Scotland",205981,92.132284045615847,72.023633247726735,18.258965632752535,1.8496851651365904]

{"sheet":"Employment","index":7,"n_rows":562,"n_cols":7,"rows_kept":562,"cut":false,"hidden":true,"merged":[]}
["Lookup","Year","Area","Level","SDC","Rate","CI"]
[{"$f":"B2&C2","v":"2005Aberdeen City"},2005,"Aberdeen City",19200,null,0.629,7.3999999999999996E-2]
[{"$f":"B3&C3","v":"2005Aberdeenshire"},2005,"Aberdeenshire",16100,null,0.69599999999999995,7.5999999999999998E-2]
["2005Angus",2005,"Angus",6800,null,0.65400000000000003,7.4999999999999997E-2]
["2005Argyll and Bute",2005,"Argyll and Bute",5100,null,0.65100000000000002,7.3999999999999996E-2]
["2005City of Edinburgh",2005,"City of Edinburgh",34600,null,0.53900000000000003,7.0999999999999994E-2]
["2005Clackmannanshire",2005,"Clackmannanshire",3200,null,0.72799999999999998,0.106]
["2005Dumfries and Galloway",2005,"Dumfries and Galloway",9000,null,0.67500000000000004,6.9000000000000006E-2]
["2005Dundee City",2005,"Dundee City",13200,null,0.60699999999999998,5.8999999999999997E-2]
["2005East Ayrshire",2005,"East Ayrshire",7900,null,0.61699999999999999,6.4000000000000001E-2]
["2005East Dunbartonshire",2005,"East Dunbartonshire",6900,null,0.61099999999999999,6.7000000000000004E-2]
["2005East Lothian",2005,"East Lothian",5400,null,0.65900000000000003,8.4000000000000005E-2]
["2005East Renfrewshire",2005,"East Renfrewshire",5900,null,0.63300000000000001,7.1999999999999995E-2]
["2005Falkirk",2005,"Falkirk",11600,null,0.73699999999999999,7.0999999999999994E-2]
["2005Fife",2005,"Fife",27200,null,0.66,7.0000000000000007E-2]
["2005Glasgow City",2005,"Glasgow City",47800,null,0.58399999999999996,6.6000000000000003E-2]
["2005Highland",2005,"Highland",15000,null,0.751,7.3999999999999996E-2]
["2005Inverclyde",2005,"Inverclyde",5300,null,0.57199999999999995,7.0000000000000007E-2]
["2005Midlothian",2005,"Midlothian",5900,null,0.70799999999999996,7.8E-2]
["2005Moray",2005,"Moray",6400,null,0.72799999999999998,7.0000000000000007E-2]
["2005Na h-Eileanan Siar",2005,"Na h-Eileanan Siar",2100,null,0.64900000000000002,0.14099999999999999]
["2005North Ayrshire",2005,"North Ayrshire",9200,null,0.63100000000000001,6.4000000000000001E-2]
["2005North Lanarkshire",2005,"North Lanarkshire",24600,null,0.64100000000000001,6.0999999999999999E-2]
["2005Orkney Islands",2005,"Orkney Islands",1300,null,0.79600000000000004,0.13200000000000001]
["2005Perth and Kinross",2005,"Perth and Kinross",7500,null,0.63500000000000001,8.4000000000000005E-2]
["2005Renfrewshire",2005,"Renfrewshire",12600,null,0.66400000000000003,6.0999999999999999E-2]
["2005Scotland",2005,"Scotland",373400,null,0.63700000000000001,1.2999999999999999E-2]
["2005Scottish Borders",2005,"Scottish Borders",5600,null,0.60199999999999998,7.9000000000000001E-2]
["2005Shetland Islands",2005,"Shetland Islands",1700,null,0.748,0.13600000000000001]
["2005South Ayrshire",2005,"South Ayrshire",6300,null,0.57899999999999996,7.4999999999999997E-2]
["2005South Lanarkshire",2005,"South Lanarkshire",23300,null,0.69599999999999995,6.9000000000000006E-2]
["2005Stirling",2005,"Stirling",7300,null,0.67500000000000004,8.5000000000000006E-2]
["2005West Dunbartonshire",2005,"West Dunbartonshire",6500,null,0.59399999999999997,6.4000000000000001E-2]
["2005West Lothian",2005,"West Lothian",12900,null,0.73299999999999998,7.2999999999999995E-2]
["2006Aberdeen City",2006,"Aberdeen City",20600,null,0.67300000000000004,7.0999999999999994E-2]
["2006Aberdeenshire",2006,"Aberdeenshire",16500,null,0.70199999999999996,7.5999999999999998E-2]
["2006Angus",2006,"Angus",7300,null,0.68500000000000005,6.9000000000000006E-2]
["2006Argyll and Bute",2006,"Argyll and Bute",5400,null,0.67200000000000004,7.9000000000000001E-2]
["2006City of Edinburgh",2006,"City of Edinburgh",38300,null,0.58799999999999997,6.9000000000000006E-2]
["2006Clackmannanshire",2006,"Clackmannanshire",2600,null,0.63900000000000001,0.12]
["2006Dumfries and Galloway",2006,"Dumfries and Galloway",9600,null,0.71399999999999997,6.9000000000000006E-2]
["2006Dundee City",2006,"Dundee City",12800,null,0.58299999999999996,6.3E-2]
["2006East Ayrshire",2006,"East Ayrshire",8800,null,0.67500000000000004,6.7000000000000004E-2]
["2006East Dunbartonshire",2006,"East Dunbartonshire",8200,null,0.73499999999999999,6.3E-2]
["2006East Lothian",2006,"East Lothian",5500,null,0.65400000000000003,7.5999999999999998E-2]
["2006East Renfrewshire",2006,"East Renfrewshire",6100,null,0.66,7.3999999999999996E-2]
["2006Falkirk",2006,"Falkirk",11300,null,0.71499999999999997,7.0000000000000007E-2]
["2006Fife",2006,"Fife",26800,null,0.64500000000000002,7.0999999999999994E-2]
["2006Glasgow City",2006,"Glasgow City",43400,null,0.52400000000000002,6.9000000000000006E-2]
["2006Highland",2006,"Highland",13800,null,0.68100000000000005,8.8999999999999996E-2]
["2006Inverclyde",2006,"Inverclyde",5200,null,0.55500000000000005,7.3999999999999996E-2]
["2006Midlothian",2006,"Midlothian",5800,null,0.70199999999999996,8.4000000000000005E-2]
["2006Moray",2006,"Moray",5900,null,0.65100000000000002,7.0999999999999994E-2]
["2006Na h-Eileanan Siar",2006,"Na h-Eileanan Siar",2200,"*",0.70699999999999996,0.14699999999999999]
["2006North Ayrshire",2006,"North Ayrshire",8400,null,0.57899999999999996,6.8000000000000005E-2]
["2006North Lanarkshire",2006,"North Lanarkshire",22900,null,0.59899999999999998,6.6000000000000003E-2]
["2006Orkney Islands",2006,"Orkney Islands",1600,"*",0.84899999999999998,0.128]
["2006Perth and Kinross",2006,"Perth and Kinross",7600,null,0.628,7.9000000000000001E-2]
["2006Renfrewshire",2006,"Renfrewshire",12200,null,0.64500000000000002,6.8000000000000005E-2]
["2006Scotland",2006,"Scotland",371500,null,0.629,1.4E-2]
["2006Scottish Borders",2006,"Scottish Borders",6100,null,0.63800000000000001,8.5000000000000006E-2]
["2006Shetland Islands",2006,"Shetland Islands",1900,null,0.76200000000000001,0.129]
["2006South Ayrshire",2006,"South Ayrshire",6400,null,0.58499999999999996,6.7000000000000004E-2]
["2006South Lanarkshire",2006,"South Lanarkshire",22300,null,0.67600000000000005,7.3999999999999996E-2]
["2006Stirling",2006,"Stirling",7200,null,0.64300000000000002,8.5999999999999993E-2]
["2006West Dunbartonshire",2006,"West Dunbartonshire",6700,null,0.61199999999999999,6.5000000000000002E-2]
[{"$f":"B67&C67","v":"2006West Lothian"},2006,"West Lothian",12300,null,0.68899999999999995,7.3999999999999996E-2]
["2007Aberdeen City",2007,"Aberdeen City",23100,null,0.74199999999999999,6.7000000000000004E-2]
["2007Aberdeenshire",2007,"Aberdeenshire",18800,null,0.78400000000000003,7.0000000000000007E-2]
["2007Angus",2007,"Angus",7400,null,0.69199999999999995,6.5000000000000002E-2]
["2007Argyll and Bute",2007,"Argyll and Bute",6000,null,0.73299999999999998,8.4000000000000005E-2]
["2007City of Edinburgh",2007,"City of Edinburgh",38100,null,0.58199999999999996,7.3999999999999996E-2]
["2007Clackmannanshire",2007,"Clackmannanshire",2600,null,0.64100000000000001,0.126]
["2007Dumfries and Galloway",2007,"Dumfries and Galloway",8800,null,0.64200000000000002,0.08]
["2007Dundee City",2007,"Dundee City",13900,null,0.63100000000000001,6.6000000000000003E-2]
["2007East Ayrshire",2007,"East Ayrshire",7600,null,0.57999999999999996,7.0999999999999994E-2]
["2007East Dunbartonshire",2007,"East Dunbartonshire",7100,null,0.64300000000000002,7.4999999999999997E-2]
["2007East Lothian",2007,"East Lothian",5400,null,0.61799999999999999,7.4999999999999997E-2]
["2007East Renfrewshire",2007,"East Renfrewshire",6300,null,0.68200000000000005,7.1999999999999995E-2]
["2007Falkirk",2007,"Falkirk",11300,null,0.71499999999999997,7.4999999999999997E-2]
["2007Fife",2007,"Fife",24200,null,0.58399999999999996,7.8E-2]
["2007Glasgow City",2007,"Glasgow City",42000,null,0.503,6.5000000000000002E-2]
["2007Highland",2007,"Highland",14500,null,0.70099999999999996,9.8000000000000004E-2]
["2007Inverclyde",2007,"Inverclyde",5500,null,0.59099999999999997,7.6999999999999999E-2]
["2007Midlothian",2007,"Midlothian",5300,null,0.628,9.8000000000000004E-2]
["2007Moray",2007,"Moray",6100,null,0.66600000000000004,6.4000000000000001E-2]
["2007Na h-Eileanan Siar",2007,"Na h-Eileanan Siar",1800,"*",0.65500000000000003,0.16]
["2007North Ayrshire",2007,"North Ayrshire",9100,null,0.623,6.9000000000000006E-2]
["2007North Lanarkshire",2007,"North Lanarkshire",24700,null,0.64700000000000002,6.7000000000000004E-2]
["2007Orkney Islands",2007,"Orkney Islands",1600,"*",0.67700000000000005,0.17299999999999999]
["2007Perth and Kinross",2007,"Perth and Kinross",8100,null,0.64800000000000002,7.4999999999999997E-2]
["2007Renfrewshire",2007,"Renfrewshire",12800,null,0.67400000000000004,7.0000000000000007E-2]
["2007Scotland",2007,"Scotland",377600,null,0.63400000000000001,1.4E-2]
["2007Scottish Borders",2007,"Scottish Borders",6900,null,0.71299999999999997,7.8E-2]
["2007Shetland Islands",2007,"Shetland Islands",2100,null,0.80400000000000005,0.11899999999999999]
["2007South Ayrshire",2007,"South Ayrshire",7100,null,0.64400000000000002,6.8000000000000005E-2]
["2007South Lanarkshire",2007,"South Lanarkshire",22900,null,0.69599999999999995,6.4000000000000001E-2]
["2007Stirling",2007,"Stirling",7200,null,0.623,8.6999999999999994E-2]
["2007West Dunbartonshire",2007,"West Dunbartonshire",6400,null,0.58899999999999997,6.5000000000000002E-2]
["2007West Lothian",2007,"West Lothian",12800,null,0.70599999999999996,7.5999999999999998E-2]
["2008Aberdeen City",2008,"Aberdeen City",23000,null,0.72499999999999998,7.0000000000000007E-2]
["2008Aberdeenshire",2008,"Aberdeenshire",16400,null,0.67700000000000005,7.4999999999999997E-2]
["2008Angus",2008,"Angus",7200,null,0.65600000000000003,7.2999999999999995E-2]
["2008Argyll and Bute",2008,"Argyll and Bute",5500,null,0.65900000000000003,8.4000000000000005E-2]
["2008City of Edinburgh",2008,"City of Edinburgh",38300,null,0.57999999999999996,7.3999999999999996E-2]
["2008Clackmannanshire",2008,"Clackmannanshire",2300,"*",0.48099999999999998,0.14799999999999999]
["2008Dumfries and Galloway",2008,"Dumfries and Galloway",9700,null,0.69499999999999995,8.1000000000000003E-2]
["2008Dundee City",2008,"Dundee City",14000,null,0.625,6.3E-2]
["2008East Ayrshire",2008,"East Ayrshire",8300,null,0.628,6.8000000000000005E-2]
["2008East Dunbartonshire",2008,"East Dunbartonshire",6200,null,0.55900000000000005,0.08]
["2008East Lothian",2008,"East Lothian",6500,null,0.68700000000000006,7.5999999999999998E-2]
["2008East Renfrewshire",2008,"East Renfrewshire",5300,null,0.56100000000000005,7.3999999999999996E-2]
["2008Falkirk",2008,"Falkirk",10700,null,0.66900000000000004,7.4999999999999997E-2]
["2008Fife",2008,"Fife",23000,null,0.55700000000000005,8.7999999999999995E-2]
["2008Glasgow City",2008,"Glasgow City",45700,null,0.54200000000000004,5.8000000000000003E-2]
["2008Highland",2008,"Highland",15000,null,0.71099999999999997,8.3000000000000004E-2]
["2008Inverclyde",2008,"Inverclyde",5500,null,0.59199999999999997,7.9000000000000001E-2]
["2008Midlothian",2008,"Midlothian",6200,null,0.72199999999999998,8.6999999999999994E-2]
["2008Moray",2008,"Moray",6200,null,0.65900000000000003,6.8000000000000005E-2]
["2008Na h-Eileanan Siar",2008,"Na h-Eileanan Siar",2300,"*",0.68300000000000005,0.156]
["2008North Ayrshire",2008,"North Ayrshire",7400,null,0.505,7.4999999999999997E-2]
["2008North Lanarkshire",2008,"North Lanarkshire",25400,null,0.66400000000000003,7.5999999999999998E-2]
["2008Orkney Islands",2008,"Orkney Islands",1300,"*",0.77700000000000002,0.16600000000000001]
["2008Perth and Kinross",2008,"Perth and Kinross",8000,null,0.61499999999999999,7.6999999999999999E-2]
["2008Renfrewshire",2008,"Renfrewshire",11900,null,0.622,6.9000000000000006E-2]
["2008Scotland",2008,"Scotland",375300,null,0.623,1.4E-2]
["2008Scottish Borders",2008,"Scottish Borders",6500,null,0.65200000000000002,8.3000000000000004E-2]
["2008Shetland Islands",2008,"Shetland Islands",1700,"*",0.78,0.14799999999999999]
["2008South Ayrshire",2008,"South Ayrshire",6700,null,0.60199999999999998,7.3999999999999996E-2]
["2008South Lanarkshire",2008,"South Lanarkshire",23800,null,0.71799999999999997,7.0000000000000007E-2]
[{"$f":"B131&C131","v":"2008Stirling"},2008,"Stirling",6300,null,0.53900000000000003,9.8000000000000004E-2]
["2008West Dunbartonshire",2008,"West Dunbartonshire",6600,null,0.61099999999999999,6.8000000000000005E-2]
["2008West Lothian",2008,"West Lothian",12600,null,0.68200000000000005,7.1999999999999995E-2]
["2009Aberdeen City",2009,"Aberdeen City",23900,null,0.73499999999999999,8.2000000000000003E-2]
["2009Aberdeenshire",2009,"Aberdeenshire",18000,null,0.73699999999999999,7.0999999999999994E-2]
["2009Angus",2009,"Angus",8100,null,0.72599999999999998,7.8E-2]
["2009Argyll and Bute",2009,"Argyll and Bute",4400,null,0.53100000000000003,8.7999999999999995E-2]
["2009City of Edinburgh",2009,"City of Edinburgh",37900,null,0.56899999999999995,7.2999999999999995E-2]
["2009Clackmannanshire",2009,"Clackmannanshire",2200,"*",0.45800000000000002,0.14399999999999999]
["2009Dumfries and Galloway",2009,"Dumfries and Galloway",8700,null,0.61899999999999999,8.2000000000000003E-2]
["2009Dundee City",2009,"Dundee City",11200,null,0.49099999999999999,7.0000000000000007E-2]
["2009East Ayrshire",2009,"East Ayrshire",9100,null,0.67700000000000005,7.2999999999999995E-2]
["2009East Dunbartonshire",2009,"East Dunbartonshire",5600,null,0.5,8.6999999999999994E-2]
["2009East Lothian",2009,"East Lothian",7000,null,0.69299999999999995,7.5999999999999998E-2]
["2009East Renfrewshire",2009,"East Renfrewshire",5100,null,0.53300000000000003,7.8E-2]
["2009Falkirk",2009,"Falkirk",10700,null,0.66600000000000004,7.5999999999999998E-2]
["2009Fife",2009,"Fife",24100,null,0.58399999999999996,9.2999999999999999E-2]
["2009Glasgow City",2009,"Glasgow City",42300,null,0.495,5.5E-2]
["2009Highland",2009,"Highland",12600,null,0.58799999999999997,9.5000000000000001E-2]
["2009Inverclyde",2009,"Inverclyde",5000,null,0.53700000000000003,8.6999999999999994E-2]
["2009Midlothian",2009,"Midlothian",5000,null,0.57699999999999996,0.10100000000000001]
["2009Moray",2009,"Moray",6400,null,0.67100000000000004,7.8E-2]
["2009Na h-Eileanan Siar",2009,"Na h-Eileanan Siar",1300,"*",0.46800000000000003,0.20399999999999999]
["2009North Ayrshire",2009,"North Ayrshire",8500,null,0.57599999999999996,7.6999999999999999E-2]
["2009North Lanarkshire",2009,"North Lanarkshire",24700,null,0.64400000000000002,7.4999999999999997E-2]
["2009Orkney Islands",2009,"Orkney Islands",1400,"*",0.80200000000000005,0.15]
["2009Perth and Kinross",2009,"Perth and Kinross",8400,null,0.627,8.6999999999999994E-2]
["2009Renfrewshire",2009,"Renfrewshire",12900,null,0.66900000000000004,7.0999999999999994E-2]
["2009Scotland",2009,"Scotland",364500,null,0.59799999999999998,1.4999999999999999E-2]
["2009Scottish Borders",2009,"Scottish Borders",6300,null,0.61799999999999999,8.5999999999999993E-2]
["2009Shetland Islands",2009,"Shetland Islands",2100,null,0.76900000000000002,0.127]
["2009South Ayrshire",2009,"South Ayrshire",7000,null,0.625,7.1999999999999995E-2]
["2009South Lanarkshire",2009,"South Lanarkshire",20100,null,0.60699999999999998,8.1000000000000003E-2]
["2009Stirling",2009,"Stirling",6800,null,0.58199999999999996,9.2999999999999999E-2]
["2009West Dunbartonshire",2009,"West Dunbartonshire",6200,null,0.57399999999999995,7.4999999999999997E-2]
["2009West Lothian",2009,"West Lothian",11700,null,0.624,8.2000000000000003E-2]
["2010Aberdeen City",2010,"Aberdeen City",23800,null,0.71099999999999997,7.2999999999999995E-2]
["2010Aberdeenshire",2010,"Aberdeenshire",17000,null,0.68700000000000006,8.3000000000000004E-2]
["2010Angus",2010,"Angus",6200,null,0.54900000000000004,8.7999999999999995E-2]
["2010Argyll and Bute",2010,"Argyll and Bute",4800,null,0.57199999999999995,8.8999999999999996E-2]
["2010City of Edinburgh",2010,"City of Edinburgh",31600,null,0.46600000000000003,7.3999999999999996E-2]
["2010Clackmannanshire",2010,"Clackmannanshire",2700,"*",0.62,0.14499999999999999]
["2010Dumfries and Galloway",2010,"Dumfries and Galloway",8800,null,0.625,7.9000000000000001E-2]
["2010Dundee City",2010,"Dundee City",12400,null,0.53600000000000003,7.0999999999999994E-2]
["2010East Ayrshire",2010,"East Ayrshire",7800,null,0.57299999999999995,7.1999999999999995E-2]
["2010East Dunbartonshire",2010,"East Dunbartonshire",6600,null,0.57999999999999996,8.3000000000000004E-2]
["2010East Lothian",2010,"East Lothian",5500,null,0.53300000000000003,0.09]
["2010East Renfrewshire",2010,"East Renfrewshire",4800,null,0.495,8.1000000000000003E-2]
["2010Falkirk",2010,"Falkirk",9000,null,0.56100000000000005,8.5999999999999993E-2]
["2010Fife",2010,"Fife",23500,null,0.56899999999999995,8.4000000000000005E-2]
["2010Glasgow City",2010,"Glasgow City",40900,null,0.47199999999999998,5.6000000000000001E-2]
["2010Highland",2010,"Highland",13300,null,0.61599999999999999,9.0999999999999998E-2]
["2010Inverclyde",2010,"Inverclyde",4400,null,0.48099999999999998,0.09]
["2010Midlothian",2010,"Midlothian",5000,null,0.57299999999999995,0.10199999999999999]
["2010Moray",2010,"Moray",6600,null,0.68,0.08]
["2010Na h-Eileanan Siar",2010,"Na h-Eileanan Siar",0,"***",0,0]
["2010North Ayrshire",2010,"North Ayrshire",7700,null,0.52200000000000002,7.8E-2]
["2010North Lanarkshire",2010,"North Lanarkshire",23500,null,0.61699999999999999,0.08]
["2010Orkney Islands",2010,"Orkney Islands",0,"***",0,0]
["2010Perth and Kinross",2010,"Perth and Kinross",7300,null,0.52900000000000003,8.8999999999999996E-2]
["2010Renfrewshire",2010,"Renfrewshire",9900,null,0.50800000000000001,7.8E-2]
["2010Scotland",2010,"Scotland",340400,null,0.55300000000000005,1.4999999999999999E-2]
["2010Scottish Borders",2010,"Scottish Borders",5200,null,0.51100000000000001,8.7999999999999995E-2]
["2010Shetland Islands",2010,"Shetland Islands",2700,null,0.80400000000000005,0.111]
[{"$f":"B195&C195","v":"2010South Ayrshire"},2010,"South Ayrshire",6900,null,0.61499999999999999,0.08]
["2010South Lanarkshire",2010,"South Lanarkshire",18600,null,0.56200000000000006,7.4999999999999997E-2]
["2010Stirling",2010,"Stirling",6100,null,0.51800000000000002,8.3000000000000004E-2]
["2010West Dunbartonshire",2010,"West Dunbartonshire",5400,null,0.504,7.3999999999999996E-2]
["2010West Lothian",2010,"West Lothian",10000,null,0.53200000000000003,8.6999999999999994E-2]
["2011Aberdeen City",2011,"Aberdeen City",23200,null,0.67600000000000005,7.8E-2]
["2011Aberdeenshire",2011,"Aberdeenshire",17600,null,0.70299999999999996,8.4000000000000005E-2]
["2011Angus",2011,"Angus",6100,null,0.53700000000000003,0.09]
["2011Argyll and Bute",2011,"Argyll and Bute",4900,null,0.57899999999999996,9.0999999999999998E-2]
["2011City of Edinburgh",2011,"City of Edinburgh",39300,null,0.56399999999999995,7.0000000000000007E-2]
["2011Clackmannanshire",2011,"Clackmannanshire",2700,null,0.621,0.14199999999999999]
["2011Dumfries and Galloway",2011,"Dumfries and Galloway",7300,null,0.50800000000000001,9.8000000000000004E-2]
["2011Dundee City",2011,"Dundee City",14700,null,0.61499999999999999,8.1000000000000003E-2]
["2011East Ayrshire",2011,"East Ayrshire",6500,null,0.48299999999999998,7.3999999999999996E-2]
["2011East Dunbartonshire",2011,"East Dunbartonshire",5200,null,0.45800000000000002,8.5000000000000006E-2]
["2011East Lothian",2011,"East Lothian",5500,null,0.53100000000000003,9.7000000000000003E-2]
["2011East Renfrewshire",2011,"East Renfrewshire",4800,null,0.48699999999999999,0.08]
["2011Falkirk",2011,"Falkirk",9800,null,0.60799999999999998,8.5999999999999993E-2]
["2011Fife",2011,"Fife",23700,null,0.56799999999999995,8.2000000000000003E-2]
["2011Glasgow City",2011,"Glasgow City",39400,null,0.45,0.06]
["2011Highland",2011,"Highland",13300,null,0.60799999999999998,0.09]
["2011Inverclyde",2011,"Inverclyde",5500,null,0.61399999999999999,8.5000000000000006E-2]
["2011Midlothian",2011,"Midlothian",5500,null,0.622,9.4E-2]
["2011Moray",2011,"Moray",6400,null,0.66400000000000003,9.9000000000000005E-2]
["2011Na h-Eileanan Siar",2011,"Na h-Eileanan Siar",0,"***",0,0]
["2011North Ayrshire",2011,"North Ayrshire",6300,null,0.42599999999999999,8.3000000000000004E-2]
["2011North Lanarkshire",2011,"North Lanarkshire",22700,null,0.59899999999999998,7.4999999999999997E-2]
["2011Orkney Islands",2011,"Orkney Islands",0,"***",0,0]
["2011Perth and Kinross",2011,"Perth and Kinross",8800,null,0.628,9.0999999999999998E-2]
["2011Renfrewshire",2011,"Renfrewshire",9800,null,0.499,7.9000000000000001E-2]
["2011Scotland",2011,"Scotland",344700,null,0.55400000000000005,1.6E-2]
["2011Scottish Borders",2011,"Scottish Borders",5000,null,0.48199999999999998,9.6000000000000002E-2]
["2011Shetland Islands",2011,"Shetland Islands",2100,null,0.68500000000000005,0.13600000000000001]
["2011South Ayrshire",2011,"South Ayrshire",5700,null,0.503,8.5000000000000006E-2]
["2011South Lanarkshire",2011,"South Lanarkshire",18900,null,0.57499999999999996,8.5000000000000006E-2]
["2011Stirling",2011,"Stirling",5800,null,0.47499999999999998,8.4000000000000005E-2]
["2011West Dunbartonshire",2011,"West Dunbartonshire",5400,null,0.51900000000000002,8.2000000000000003E-2]
["2011West Lothian",2011,"West Lothian",10200,null,0.54100000000000004,9.4E-2]
["2012Aberdeen City",2012,"Aberdeen City",23200,null,0.67,7.6999999999999999E-2]
["2012Aberdeenshire",2012,"Aberdeenshire",18100,null,0.71899999999999997,8.5999999999999993E-2]
["2012Angus",2012,"Angus",5300,null,0.46200000000000002,0.09]
["2012Argyll and Bute",2012,"Argyll and Bute",4500,null,0.53700000000000003,0.104]
["2012City of Edinburgh",2012,"City of Edinburgh",34700,null,0.496,7.6999999999999999E-2]
["2012Clackmannanshire",2012,"Clackmannanshire",1400,"*",0.35499999999999998,0.17399999999999999]
["2012Dumfries and Galloway",2012,"Dumfries and Galloway",8800,null,0.60599999999999998,0.09]
["2012Dundee City",2012,"Dundee City",10400,null,0.42799999999999999,6.9000000000000006E-2]
["2012East Ayrshire",2012,"East Ayrshire",6700,null,0.498,8.4000000000000005E-2]
["2012East Dunbartonshire",2012,"East Dunbartonshire",5600,null,0.48199999999999998,8.8999999999999996E-2]
["2012East Lothian",2012,"East Lothian",5900,null,0.56599999999999995,0.10100000000000001]
["2012East Renfrewshire",2012,"East Renfrewshire",5000,null,0.501,9.8000000000000004E-2]
["2012Falkirk",2012,"Falkirk",9300,null,0.57699999999999996,0.08]
["2012Fife",2012,"Fife",24100,null,0.57199999999999995,7.8E-2]
["2012Glasgow City",2012,"Glasgow City",37300,null,0.42599999999999999,7.1999999999999995E-2]
["2012Highland",2012,"Highland",15400,null,0.70399999999999996,8.1000000000000003E-2]
["2012Inverclyde",2012,"Inverclyde",3900,null,0.439,8.5000000000000006E-2]
["2012Midlothian",2012,"Midlothian",5700,null,0.64400000000000002,0.113]
["2012Moray",2012,"Moray",6900,null,0.71399999999999997,7.9000000000000001E-2]
["2012Na h-Eileanan Siar",2012,"Na h-Eileanan Siar",1500,"*",0.45300000000000001,0.19500000000000001]
["2012North Ayrshire",2012,"North Ayrshire",5700,null,0.38300000000000001,8.1000000000000003E-2]
["2012North Lanarkshire",2012,"North Lanarkshire",21500,null,0.56799999999999995,7.0999999999999994E-2]
["2012Orkney Islands",2012,"Orkney Islands",1800,"*",0.65300000000000002,0.17599999999999999]
["2012Perth and Kinross",2012,"Perth and Kinross",8300,null,0.58099999999999996,8.6999999999999994E-2]
["2012Renfrewshire",2012,"Renfrewshire",8400,null,0.432,8.3000000000000004E-2]
["2012Scotland",2012,"Scotland",333300,null,0.53400000000000003,1.6E-2]
[{"$f":"B259&C259","v":"2012Scottish Borders"},2012,"Scottish Borders",5200,null,0.504,8.5999999999999993E-2]
["2012Shetland Islands",2012,"Shetland Islands",1500,"*",0.629,0.21199999999999999]
["2012South Ayrshire",2012,"South Ayrshire",6100,null,0.53800000000000003,9.5000000000000001E-2]
["2012South Lanarkshire",2012,"South Lanarkshire",17800,null,0.54300000000000004,8.4000000000000005E-2]
["2012Stirling",2012,"Stirling",6900,null,0.54700000000000004,9.5000000000000001E-2]
["2012West Dunbartonshire",2012,"West Dunbartonshire",5000,null,0.48699999999999999,7.6999999999999999E-2]
["2012West Lothian",2012,"West Lothian",11400,null,0.60199999999999998,8.3000000000000004E-2]
["2013Aberdeen City",2013,"Aberdeen City",22800,null,0.66300000000000003,8.1000000000000003E-2]
["2013Aberdeenshire",2013,"Aberdeenshire",18200,null,0.72299999999999998,9.2999999999999999E-2]
["2013Angus",2013,"Angus",7600,null,0.66,8.5999999999999993E-2]
["2013Argyll and Bute",2013,"Argyll and Bute",3900,null,0.47399999999999998,0.1]
["2013City of Edinburgh",2013,"City of Edinburgh",31700,null,0.45900000000000002,8.2000000000000003E-2]
["2013Clackmannanshire",2013,"Clackmannanshire",1900,"*",0.442,0.152]
["2013Dumfries and Galloway",2013,"Dumfries and Galloway",7400,null,0.51500000000000001,8.5000000000000006E-2]
["2013Dundee City",2013,"Dundee City",13100,null,0.54500000000000004,7.5999999999999998E-2]
["2013East Ayrshire",2013,"East Ayrshire",7000,null,0.53,7.9000000000000001E-2]
["2013East Dunbartonshire",2013,"East Dunbartonshire",6100,null,0.52900000000000003,8.6999999999999994E-2]
["2013East Lothian",2013,"East Lothian",5800,null,0.54300000000000004,0.1]
["2013East Renfrewshire",2013,"East Renfrewshire",4800,null,0.48,8.6999999999999994E-2]
["2013Falkirk",2013,"Falkirk",10900,null,0.67800000000000005,8.5999999999999993E-2]
["2013Fife",2013,"Fife",21300,null,0.505,8.8999999999999996E-2]
["2013Glasgow City",2013,"Glasgow City",30500,null,0.35699999999999998,7.6999999999999999E-2]
["2013Highland",2013,"Highland",12400,null,0.56699999999999995,0.12]
["2013Inverclyde",2013,"Inverclyde",4900,null,0.55800000000000005,9.8000000000000004E-2]
["2013Midlothian",2013,"Midlothian",5100,null,0.57599999999999996,9.5000000000000001E-2]
["2013Moray",2013,"Moray",6300,null,0.64600000000000002,0.08]
["2013Na h-Eileanan Siar",2013,"Na h-Eileanan Siar",1600,"*",0.50600000000000001,0.161]
["2013North Ayrshire",2013,"North Ayrshire",7000,null,0.47599999999999998,8.2000000000000003E-2]
["2013North Lanarkshire",2013,"North Lanarkshire",21700,null,0.56899999999999995,7.2999999999999995E-2]
["2013Orkney Islands",2013,"Orkney Islands",1600,"*",0.68300000000000005,0.215]
["2013Perth and Kinross",2013,"Perth and Kinross",7300,null,0.50900000000000001,9.9000000000000005E-2]
["2013Renfrewshire",2013,"Renfrewshire",11000,null,0.57199999999999995,8.6999999999999994E-2]
["2013Scotland",2013,"Scotland",330100,null,0.53200000000000003,1.6E-2]
["2013Scottish Borders",2013,"Scottish Borders",6100,null,0.58699999999999997,8.7999999999999995E-2]
["2013Shetland Islands",2013,"Shetland Islands",1600,"*",0.67800000000000005,0.254]
["2013South Ayrshire",2013,"South Ayrshire",6100,null,0.54600000000000004,9.5000000000000001E-2]
["2013South Lanarkshire",2013,"South Lanarkshire",20800,null,0.63600000000000001,7.9000000000000001E-2]
["2013Stirling",2013,"Stirling",7200,null,0.56699999999999995,9.1999999999999998E-2]
["2013West Dunbartonshire",2013,"West Dunbartonshire",5500,null,0.54100000000000004,7.5999999999999998E-2]
["2013West Lothian",2013,"West Lothian",10500,null,0.55700000000000005,8.2000000000000003E-2]
["2014Aberdeen City",2014,"Aberdeen City",22600,null,0.66700000000000004,7.3999999999999996E-2]
["2014Aberdeenshire",2014,"Aberdeenshire",15700,null,0.622,9.5000000000000001E-2]
["2014Angus",2014,"Angus",6000,null,0.51200000000000001,9.7000000000000003E-2]
["2014Argyll and Bute",2014,"Argyll and Bute",5300,null,0.622,9.6000000000000002E-2]
["2014City of Edinburgh",2014,"City of Edinburgh",27600,null,0.40600000000000003,7.4999999999999997E-2]
["2014Clackmannanshire",2014,"Clackmannanshire",1400,"*",0.38100000000000001,0.14899999999999999]
["2014Dumfries and Galloway",2014,"Dumfries and Galloway",9000,null,0.63,8.4000000000000005E-2]
["2014Dundee City",2014,"Dundee City",11900,null,0.505,7.2999999999999995E-2]
["2014East Ayrshire",2014,"East Ayrshire",6700,null,0.50900000000000001,8.6999999999999994E-2]
["2014East Dunbartonshire",2014,"East Dunbartonshire",5100,null,0.44400000000000001,9.8000000000000004E-2]
["2014East Lothian",2014,"East Lothian",6000,null,0.56499999999999995,9.6000000000000002E-2]
["2014East Renfrewshire",2014,"East Renfrewshire",5000,null,0.498,9.1999999999999998E-2]
["2014Falkirk",2014,"Falkirk",9100,null,0.56299999999999994,8.6999999999999994E-2]
["2014Fife",2014,"Fife",22400,null,0.53400000000000003,8.2000000000000003E-2]
["2014Glasgow City",2014,"Glasgow City",33000,null,0.39700000000000002,8.3000000000000004E-2]
["2014Highland",2014,"Highland",12800,null,0.59099999999999997,0.113]
["2014Inverclyde",2014,"Inverclyde",5200,null,0.60399999999999998,8.2000000000000003E-2]
["2014Midlothian",2014,"Midlothian",4500,null,0.50800000000000001,0.1]
["2014Moray",2014,"Moray",6000,null,0.61599999999999999,8.1000000000000003E-2]
["2014Na h-Eileanan Siar",2014,"Na h-Eileanan Siar",1400,"*",0.54200000000000004,0.17499999999999999]
["2014North Ayrshire",2014,"North Ayrshire",8000,null,0.55000000000000004,8.5000000000000006E-2]
["2014North Lanarkshire",2014,"North Lanarkshire",20700,null,0.54200000000000004,7.1999999999999995E-2]
["2014Orkney Islands",2014,"Orkney Islands",2400,"*",0.71699999999999997,0.17]
["2014Perth and Kinross",2014,"Perth and Kinross",8500,null,0.58199999999999996,8.8999999999999996E-2]
[{"$f":"B323&C323","v":"2014Renfrewshire"},2014,"Renfrewshire",11300,null,0.59199999999999997,8.5999999999999993E-2]
["2014Scotland",2014,"Scotland",321900,null,0.52300000000000002,1.6E-2]
["2014Scottish Borders",2014,"Scottish Borders",6500,null,0.627,8.3000000000000004E-2]
["2014Shetland Islands",2014,"Shetland Islands",1800,"*",0.74099999999999999,0.20200000000000001]
["2014South Ayrshire",2014,"South Ayrshire",6000,null,0.53900000000000003,9.5000000000000001E-2]
["2014South Lanarkshire",2014,"South Lanarkshire",18300,null,0.56000000000000005,8.2000000000000003E-2]
["2014Stirling",2014,"Stirling",5300,null,0.41499999999999998,0.10299999999999999]
["2014West Dunbartonshire",2014,"West Dunbartonshire",4800,null,0.48399999999999999,7.8E-2]
["2014West Lothian",2014,"West Lothian",11300,null,0.60299999999999998,0.08]
["2015Aberdeen City",2015,"Aberdeen City",20500,null,0.61699999999999999,8.3000000000000004E-2]
["2015Aberdeenshire",2015,"Aberdeenshire",17800,null,0.70699999999999996,9.1999999999999998E-2]
["2015Angus",2015,"Angus",5900,null,0.504,9.8000000000000004E-2]
["2015Argyll and Bute",2015,"Argyll and Bute",4400,null,0.52,0.10100000000000001]
["2015City of Edinburgh",2015,"City of Edinburgh",34700,null,0.51800000000000002,8.7999999999999995E-2]
["2015Clackmannanshire",2015,"Clackmannanshire",1700,"*",0.436,0.129]
["2015Dumfries and Galloway",2015,"Dumfries and Galloway",9100,null,0.64200000000000002,7.5999999999999998E-2]
["2015Dundee City",2015,"Dundee City",10800,null,0.47199999999999998,7.4999999999999997E-2]
["2015East Ayrshire",2015,"East Ayrshire",6900,null,0.53500000000000003,9.5000000000000001E-2]
["2015East Dunbartonshire",2015,"East Dunbartonshire",5200,null,0.45800000000000002,0.10199999999999999]
["2015East Lothian",2015,"East Lothian",5100,null,0.48,0.106]
["2015East Renfrewshire",2015,"East Renfrewshire",5700,null,0.56200000000000006,0.09]
["2015Falkirk",2015,"Falkirk",9000,null,0.56100000000000005,0.08]
["2015Fife",2015,"Fife",24400,null,0.58699999999999997,8.7999999999999995E-2]
["2015Glasgow City",2015,"Glasgow City",36900,null,0.44400000000000001,7.8E-2]
["2015Highland",2015,"Highland",14900,null,0.68100000000000005,9.5000000000000001E-2]
["2015Inverclyde",2015,"Inverclyde",4300,null,0.5,9.7000000000000003E-2]
["2015Midlothian",2015,"Midlothian",4700,null,0.52100000000000002,0.111]
["2015Moray",2015,"Moray",5100,null,0.51700000000000002,9.4E-2]
["2015Na h-Eileanan Siar",2015,"Na h-Eileanan Siar",1300,"*",0.46100000000000002,0.188]
["2015North Ayrshire",2015,"North Ayrshire",7000,null,0.48199999999999998,8.2000000000000003E-2]
["2015North Lanarkshire",2015,"North Lanarkshire",21200,null,0.56699999999999995,8.1000000000000003E-2]
["2015Orkney Islands",2015,"Orkney Islands",1700,"*",0.82199999999999995,0.17699999999999999]
["2015Perth and Kinross",2015,"Perth and Kinross",8600,null,0.58099999999999996,0.10100000000000001]
["2015Renfrewshire",2015,"Renfrewshire",13000,null,0.68200000000000005,8.6999999999999994E-2]
["2015Scotland",2015,"Scotland",336900,null,0.55100000000000005,1.7000000000000001E-2]
["2015Scottish Borders",2015,"Scottish Borders",6500,null,0.63300000000000001,8.5000000000000006E-2]
["2015Shetland Islands",2015,"Shetland Islands",2300,"*",0.74399999999999999,0.20699999999999999]
["2015South Ayrshire",2015,"South Ayrshire",6300,null,0.56899999999999995,9.9000000000000005E-2]
["2015South Lanarkshire",2015,"South Lanarkshire",18300,null,0.56000000000000005,8.2000000000000003E-2]
["2015Stirling",2015,"Stirling",7200,null,0.56100000000000005,9.2999999999999999E-2]
["2015West Dunbartonshire",2015,"West Dunbartonshire",5300,null,0.53700000000000003,8.7999999999999995E-2]
["2015West Lothian",2015,"West Lothian",11100,null,0.58699999999999997,8.7999999999999995E-2]
["2016Aberdeen City",2016,"Aberdeen City",18600,null,0.58499999999999996,9.2999999999999999E-2]
["2016Aberdeenshire",2016,"Aberdeenshire",17300,null,0.69499999999999995,0.10100000000000001]
["2016Angus",2016,"Angus",7200,null,0.63200000000000001,0.104]
["2016Argyll and Bute",2016,"Argyll and Bute",5200,null,0.61399999999999999,9.8000000000000004E-2]
["2016City of Edinburgh",2016,"City of Edinburgh",28700,null,0.432,0.104]
["2016Clackmannanshire",2016,"Clackmannanshire",1400,"*",0.34899999999999998,0.11899999999999999]
["2016Dumfries and Galloway",2016,"Dumfries and Galloway",8700,null,0.61799999999999999,8.6999999999999994E-2]
["2016Dundee City",2016,"Dundee City",9700,null,0.44,8.5000000000000006E-2]
["2016East Ayrshire",2016,"East Ayrshire",6500,null,0.51400000000000001,0.10100000000000001]
["2016East Dunbartonshire",2016,"East Dunbartonshire",5500,null,0.48699999999999999,9.8000000000000004E-2]
["2016East Lothian",2016,"East Lothian",5500,null,0.52,0.1]
["2016East Renfrewshire",2016,"East Renfrewshire",5800,null,0.57999999999999996,0.10199999999999999]
["2016Falkirk",2016,"Falkirk",9600,null,0.59599999999999997,9.2999999999999999E-2]
["2016Fife",2016,"Fife",24200,null,0.58299999999999996,0.109]
["2016Glasgow City",2016,"Glasgow City",39700,null,0.48199999999999998,7.8E-2]
["2016Highland",2016,"Highland",15300,null,0.69899999999999995,0.107]
["2016Inverclyde",2016,"Inverclyde",4600,null,0.55500000000000005,9.8000000000000004E-2]
["2016Midlothian",2016,"Midlothian",5200,null,0.58199999999999996,0.14299999999999999]
["2016Moray",2016,"Moray",5500,null,0.55600000000000005,0.10100000000000001]
["2016Na h-Eileanan Siar",2016,"Na h-Eileanan Siar",1700,"*",0.63500000000000001,0.16400000000000001]
["2016North Ayrshire",2016,"North Ayrshire",6400,null,0.44400000000000001,9.5000000000000001E-2]
["2016North Lanarkshire",2016,"North Lanarkshire",24700,null,0.65300000000000002,8.2000000000000003E-2]
[{"$f":"B387&C387","v":"2016Orkney Islands"},2016,"Orkney Islands",2500,"*",0.81499999999999995,"."]
["2016Perth and Kinross",2016,"Perth and Kinross",9100,null,0.61699999999999999,0.108]
["2016Renfrewshire",2016,"Renfrewshire",12200,null,0.64700000000000002,8.5000000000000006E-2]
["2016Scotland",2016,"Scotland",339800,null,0.56100000000000005,1.7999999999999999E-2]
["2016Scottish Borders",2016,"Scottish Borders",6000,null,0.57999999999999996,9.1999999999999998E-2]
["2016Shetland Islands",2016,"Shetland Islands",1700,"*",0.76200000000000001,0.191]
["2016South Ayrshire",2016,"South Ayrshire",7300,null,0.66700000000000004,9.7000000000000003E-2]
["2016South Lanarkshire",2016,"South Lanarkshire",20000,null,0.61599999999999999,8.1000000000000003E-2]
["2016Stirling",2016,"Stirling",6400,null,0.49099999999999999,8.4000000000000005E-2]
["2016West Dunbartonshire",2016,"West Dunbartonshire",6200,null,0.64400000000000002,9.1999999999999998E-2]
["2016West Lothian",2016,"West Lothian",11500,null,0.61299999999999999,0.10100000000000001]
["2017Aberdeen City",2017,"Aberdeen City",15700,null,0.52800000000000002,9.8000000000000004E-2]
["2017Aberdeenshire",2017,"Aberdeenshire",17900,null,0.73199999999999998,0.107]
["2017Angus",2017,"Angus",6700,null,0.59799999999999998,9.7000000000000003E-2]
["2017Argyll and Bute",2017,"Argyll and Bute",5900,null,0.69499999999999995,9.8000000000000004E-2]
["2017City of Edinburgh",2017,"City of Edinburgh",35800,null,0.54600000000000004,0.106]
["2017Clackmannanshire",2017,"Clackmannanshire",2900,null,0.66600000000000004,0.129]
["2017Dumfries and Galloway",2017,"Dumfries and Galloway",8400,null,0.61,0.11]
["2017Dundee City",2017,"Dundee City",10700,null,0.505,8.5000000000000006E-2]
["2017East Ayrshire",2017,"East Ayrshire",6200,null,0.501,0.10299999999999999]
["2017East Dunbartonshire",2017,"East Dunbartonshire",5800,null,0.52700000000000002,8.7999999999999995E-2]
["2017East Lothian",2017,"East Lothian",7100,null,0.67900000000000005,0.104]
["2017East Renfrewshire",2017,"East Renfrewshire",5100,null,0.51700000000000002,0.11]
["2017Falkirk",2017,"Falkirk",11100,null,0.69799999999999995,8.7999999999999995E-2]
["2017Fife",2017,"Fife",21200,null,0.51600000000000001,0.11700000000000001]
["2017Glasgow City",2017,"Glasgow City",37200,null,0.45500000000000002,7.9000000000000001E-2]
["2017Highland",2017,"Highland",13800,null,0.63500000000000001,0.128]
["2017Inverclyde",2017,"Inverclyde",4900,null,0.60199999999999998,8.7999999999999995E-2]
["2017Midlothian",2017,"Midlothian",6800,null,0.77500000000000002,0.126]
["2017Moray",2017,"Moray",5600,null,0.57899999999999996,0.10199999999999999]
["2017Na h-Eileanan Siar",2017,"Na h-Eileanan Siar",1400,"*",0.63,0.193]
["2017North Ayrshire",2017,"North Ayrshire",7600,null,0.53900000000000003,9.4E-2]
["2017North Lanarkshire",2017,"North Lanarkshire",23100,null,0.63,9.5000000000000001E-2]
["2017Orkney Islands",2017,"Orkney Islands",2000,"*",0.86199999999999999,"."]
["2017Perth and Kinross",2017,"Perth and Kinross",9500,null,0.65500000000000003,0.1]
["2017Renfrewshire",2017,"Renfrewshire",11900,null,0.64,8.7999999999999995E-2]
["2017Scotland",2017,"Scotland",343000,null,0.57699999999999996,1.9E-2]
["2017Scottish Borders",2017,"Scottish Borders",5500,null,0.53400000000000003,0.107]
["2017Shetland Islands",2017,"Shetland Islands",2200,"*",0.78500000000000003,0.19500000000000001]
["2017South Ayrshire",2017,"South Ayrshire",6000,null,0.55700000000000005,0.11600000000000001]
["2017South Lanarkshire",2017,"South Lanarkshire",21600,null,0.67300000000000004,8.1000000000000003E-2]
["2017Stirling",2017,"Stirling",7600,null,0.58599999999999997,9.9000000000000005E-2]
["2017West Dunbartonshire",2017,"West Dunbartonshire",4500,null,0.47699999999999998,0.10199999999999999]
["2017West Lothian",2017,"West Lothian",11500,null,0.61699999999999999,0.108]
["2018Aberdeen City",2018,"Aberdeen City",17400,null,0.60399999999999998,0.108]
["2018Aberdeenshire",2018,"Aberdeenshire",14400,null,0.59799999999999998,0.11700000000000001]
["2018Angus",2018,"Angus",7100,null,0.64600000000000002,8.5000000000000006E-2]
["2018Argyll and Bute",2018,"Argyll and Bute",4800,null,0.59,0.10199999999999999]
["2018City of Edinburgh",2018,"City of Edinburgh",38700,null,0.60199999999999998,9.5000000000000001E-2]
["2018Clackmannanshire",2018,"Clackmannanshire",3500,null,0.72,0.104]
["2018Dumfries and Galloway",2018,"Dumfries and Galloway",8100,null,0.6,0.112]
["2018Dundee City",2018,"Dundee City",10900,null,0.52900000000000003,8.1000000000000003E-2]
["2018East Ayrshire",2018,"East Ayrshire",6000,null,0.499,0.10100000000000001]
["2018East Dunbartonshire",2018,"East Dunbartonshire",6500,null,0.60899999999999999,8.8999999999999996E-2]
["2018East Lothian",2018,"East Lothian",6600,null,0.64900000000000002,0.10199999999999999]
["2018East Renfrewshire",2018,"East Renfrewshire",4500,null,0.46400000000000002,0.10199999999999999]
["2018Falkirk",2018,"Falkirk",10900,null,0.69199999999999995,9.8000000000000004E-2]
["2018Fife",2018,"Fife",26400,null,0.65200000000000002,9.6000000000000002E-2]
["2018Glasgow City",2018,"Glasgow City",35000,null,0.441,7.3999999999999996E-2]
["2018Highland",2018,"Highland",15000,null,0.7,0.12]
["2018Inverclyde",2018,"Inverclyde",4200,null,0.53200000000000003,0.10100000000000001]
["2018Midlothian",2018,"Midlothian",6600,null,0.76100000000000001,0.105]
["2018Moray",2018,"Moray",6100,null,0.64300000000000002,0.10199999999999999]
["2018Na h-Eileanan Siar",2018,"Na h-Eileanan Siar",1700,"*",0.77800000000000002,0.151]
[{"$f":"B451&C451","v":"2018North Ayrshire"},2018,"North Ayrshire",8300,null,0.6,0.107]
["2018North Lanarkshire",2018,"North Lanarkshire",21400,null,0.59099999999999997,9.7000000000000003E-2]
["2018Orkney Islands",2018,"Orkney Islands",0,"***",0,0]
["2018Perth and Kinross",2018,"Perth and Kinross",9200,null,0.64400000000000002,9.4E-2]
["2018Renfrewshire",2018,"Renfrewshire",12700,null,0.69699999999999995,0.09]
["2018Scotland",2018,"Scotland",342600,null,0.58799999999999997,1.7999999999999999E-2]
["2018Scottish Borders",2018,"Scottish Borders",5500,null,0.54400000000000004,9.6000000000000002E-2]
["2018Shetland Islands",2018,"Shetland Islands",0,"***",0,0]
["2018South Ayrshire",2018,"South Ayrshire",6200,null,0.58599999999999997,0.109]
["2018South Lanarkshire",2018,"South Lanarkshire",19500,null,0.621,9.9000000000000005E-2]
["2018Stirling",2018,"Stirling",6300,null,0.495,0.105]
["2018West Dunbartonshire",2018,"West Dunbartonshire",5100,null,0.56499999999999995,9.6000000000000002E-2]
["2018West Lothian",2018,"West Lothian",11000,null,0.59299999999999997,9.9000000000000005E-2]
["2019Aberdeen City",2019,"Aberdeen City",20700,null,0.72,9.6000000000000002E-2]
["2019Aberdeenshire",2019,"Aberdeenshire",16400,null,0.69099999999999995,0.10100000000000001]
["2019Angus",2019,"Angus",7000,null,0.64600000000000002,9.2999999999999999E-2]
["2019Argyll and Bute",2019,"Argyll and Bute",4700,null,0.60799999999999998,0.108]
["2019City of Edinburgh",2019,"City of Edinburgh",35400,null,0.56299999999999994,9.7000000000000003E-2]
["2019Clackmannanshire",2019,"Clackmannanshire",3600,null,0.64900000000000002,0.124]
["2019Dumfries and Galloway",2019,"Dumfries and Galloway",7400,null,0.56100000000000005,0.112]
["2019Dundee City",2019,"Dundee City",10400,null,0.51600000000000001,7.3999999999999996E-2]
["2019East Ayrshire",2019,"East Ayrshire",6800,null,0.57399999999999995,0.106]
["2019East Dunbartonshire",2019,"East Dunbartonshire",6300,null,0.60499999999999998,9.8000000000000004E-2]
["2019East Lothian",2019,"East Lothian",6300,null,0.628,0.105]
["2019East Renfrewshire",2019,"East Renfrewshire",3600,null,0.374,9.8000000000000004E-2]
["2019Falkirk",2019,"Falkirk",8600,null,0.55000000000000004,0.10299999999999999]
["2019Fife",2019,"Fife",21700,null,0.54600000000000004,0.106]
["2019Glasgow City",2019,"Glasgow City",40400,null,0.52200000000000002,7.6999999999999999E-2]
["2019Highland",2019,"Highland",14400,null,0.68200000000000005,0.13300000000000001]
["2019Inverclyde",2019,"Inverclyde",4200,null,0.55200000000000005,0.11799999999999999]
["2019Midlothian",2019,"Midlothian",5000,null,0.59199999999999997,0.12]
["2019Moray",2019,"Moray",5900,null,0.64300000000000002,0.105]
["2019Na h-Eileanan Siar",2019,"Na h-Eileanan Siar",1500,"*",0.63600000000000001,0.20100000000000001]
["2019North Ayrshire",2019,"North Ayrshire",7700,null,0.57499999999999996,0.11]
["2019North Lanarkshire",2019,"North Lanarkshire",21800,null,0.61,9.4E-2]
["2019Orkney Islands",2019,"Orkney Islands",0,"***",0,0]
["2019Perth and Kinross",2019,"Perth and Kinross",10000,null,0.71499999999999997,9.5000000000000001E-2]
["2019Renfrewshire",2019,"Renfrewshire",11300,null,0.63500000000000001,0.09]
["2019Scotland",2019,"Scotland",337700,null,0.59099999999999997,1.9E-2]
["2019Scottish Borders",2019,"Scottish Borders",5900,null,0.59399999999999997,0.109]
["2019Shetland Islands",2019,"Shetland Islands",0,"***",0,0]
["2019South Ayrshire",2019,"South Ayrshire",6000,null,0.57699999999999996,0.122]
["2019South Lanarkshire",2019,"South Lanarkshire",16300,null,0.53200000000000003,0.11]
["2019Stirling",2019,"Stirling",8000,null,0.63300000000000001,9.5000000000000001E-2]
["2019West Dunbartonshire",2019,"West Dunbartonshire",5200,null,0.58099999999999996,9.8000000000000004E-2]
["2019West Lothian",2019,"West Lothian",12500,null,0.68200000000000005,8.8999999999999996E-2]
["2020Aberdeen City",2020,"Aberdeen City",12800,null,0.61,0.127]
["2020Aberdeenshire",2020,"Aberdeenshire",15800,null,0.61299999999999999,0.11600000000000001]
["2020Angus",2020,"Angus",5200,null,0.54700000000000004,0.114]
["2020Argyll and Bute",2020,"Argyll and Bute",4700,null,0.65800000000000003,0.109]
["2020City of Edinburgh",2020,"City of Edinburgh",29600,null,0.45200000000000001,9.2999999999999999E-2]
["2020Clackmannanshire",2020,"Clackmannanshire",2500,"*",0.54200000000000004,0.14899999999999999]
["2020Dumfries and Galloway",2020,"Dumfries and Galloway",5300,"*",0.498,0.13700000000000001]
["2020Dundee City",2020,"Dundee City",13100,null,0.60799999999999998,8.4000000000000005E-2]
["2020East Ayrshire",2020,"East Ayrshire",7500,null,0.59899999999999998,0.112]
["2020East Dunbartonshire",2020,"East Dunbartonshire",6200,null,0.56699999999999995,9.4E-2]
["2020East Lothian",2020,"East Lothian",5900,null,0.56200000000000006,0.11799999999999999]
["2020East Renfrewshire",2020,"East Renfrewshire",5600,null,0.50700000000000001,0.106]
["2020Falkirk",2020,"Falkirk",8900,null,0.58899999999999997,0.11799999999999999]
["2020Fife",2020,"Fife",17500,null,0.48499999999999999,0.106]
["2020Glasgow City",2020,"Glasgow City",38300,null,0.44,8.3000000000000004E-2]
["2020Highland",2020,"Highland",11100,"*",0.71099999999999997,0.16]
["2020Inverclyde",2020,"Inverclyde",3500,null,0.51,0.126]
["2020Midlothian",2020,"Midlothian",4500,null,0.60399999999999998,0.13300000000000001]
[{"$f":"B515&C515","v":"2020Moray"},2020,"Moray",5500,null,0.64300000000000002,0.115]
["2020Na h-Eileanan Siar",2020,"Na h-Eileanan Siar",1200,"*",0.69099999999999995,0.17399999999999999]
["2020North Ayrshire",2020,"North Ayrshire",6300,null,0.54300000000000004,0.122]
["2020North Lanarkshire",2020,"North Lanarkshire",18900,null,0.49399999999999999,0.108]
["2020Orkney Islands",2020,"Orkney Islands",0,"***",0,0]
["2020Perth and Kinross",2020,"Perth and Kinross",9400,null,0.6,0.10299999999999999]
["2020Renfrewshire",2020,"Renfrewshire",10300,null,0.54300000000000004,0.113]
["2020Scotland",2020,"Scotland",298200,null,0.53100000000000003,2.1000000000000001E-2]
["2020Scottish Borders",2020,"Scottish Borders",5700,null,0.55900000000000005,0.125]
["2020Shetland Islands",2020,"Shetland Islands",0,"***",0,0]
["2020South Ayrshire",2020,"South Ayrshire",5200,null,0.55700000000000005,0.125]
["2020South Lanarkshire",2020,"South Lanarkshire",17200,null,0.55400000000000005,0.113]
["2020Stirling",2020,"Stirling",5000,null,0.52700000000000002,0.112]
["2020West Dunbartonshire",2020,"West Dunbartonshire",4800,null,0.54600000000000004,0.10100000000000001]
["2020West Lothian",2020,"West Lothian",8100,null,0.52900000000000003,0.12]
["2021Aberdeen City",2021,"Aberdeen City",6400,"*",0.3,0.13700000000000001]
["2021Aberdeenshire",2021,"Aberdeenshire",14200,null,0.56599999999999995,0.13600000000000001]
["2021Angus",2021,"Angus",6300,null,0.48699999999999999,0.12]
["2021Argyll and Bute",2021,"Argyll and Bute",2900,"*",0.51500000000000001,0.16800000000000001]
["2021City of Edinburgh",2021,"City of Edinburgh",29500,null,0.49099999999999999,0.115]
["2021Clackmannanshire",2021,"Clackmannanshire",2900,"*",0.54600000000000004,0.21299999999999999]
["2021Dumfries and Galloway",2021,"Dumfries and Galloway",5200,"*",0.495,0.159]
["2021Dundee City",2021,"Dundee City",6800,"*",0.47799999999999998,0.13300000000000001]
["2021East Ayrshire",2021,"East Ayrshire",7100,null,0.54300000000000004,0.13500000000000001]
["2021East Dunbartonshire",2021,"East Dunbartonshire",6600,null,0.61899999999999999,0.11799999999999999]
["2021East Lothian",2021,"East Lothian",4400,"*",0.48099999999999998,0.161]
["2021East Renfrewshire",2021,"East Renfrewshire",3700,"*",0.377,0.13200000000000001]
["2021Falkirk",2021,"Falkirk",9700,"*",0.57299999999999995,0.14799999999999999]
["2021Fife",2021,"Fife",16300,"*",0.48599999999999999,0.13600000000000001]
["2021Glasgow City",2021,"Glasgow City",37800,null,0.495,0.111]
["2021Highland",2021,"Highland",14100,"*",0.66500000000000004,0.154]
["2021Inverclyde",2021,"Inverclyde",3600,"*",0.47899999999999998,0.14599999999999999]
["2021Midlothian",2021,"Midlothian",4400,"*",0.52500000000000002,0.16500000000000001]
["2021Moray",2021,"Moray",6400,null,0.64100000000000001,0.14199999999999999]
["2021Na h-Eileanan Siar",2021,"Na h-Eileanan Siar",1300,"*",0.52300000000000002,0.22500000000000001]
["2021North Ayrshire",2021,"North Ayrshire",4300,"*",0.437,0.16400000000000001]
["2021North Lanarkshire",2021,"North Lanarkshire",23700,null,0.63300000000000001,0.13100000000000001]
["2021Orkney Islands",2021,"Orkney Islands",0,"***",0,0]
["2021Perth and Kinross",2021,"Perth and Kinross",7800,"*",0.41,0.11899999999999999]
["2021Renfrewshire",2021,"Renfrewshire",10100,null,0.59899999999999998,0.13700000000000001]
["2021Scotland",2021,"Scotland",285700,null,0.51800000000000002,2.5999999999999999E-2]
["2021Scottish Borders",2021,"Scottish Borders",6500,"*",0.52300000000000002,0.14299999999999999]
["2021Shetland Islands",2021,"Shetland Islands",0,"***",0,0]
["2021South Ayrshire",2021,"South Ayrshire",4900,"*",0.48399999999999999,0.151]
["2021South Lanarkshire",2021,"South Lanarkshire",20600,null,0.66500000000000004,0.13200000000000001]
["2021Stirling",2021,"Stirling",4200,"*",0.42,0.14099999999999999]
["2021West Dunbartonshire",2021,"West Dunbartonshire",3400,"*",0.42499999999999999,0.157]
["2021West Lothian",2021,"West Lothian",9500,"*",0.47899999999999998,0.13700000000000001]

{"sheet":"ASHE","index":8,"n_rows":35,"n_cols":15,"rows_kept":35,"cut":false,"hidden":true,"merged":[[0,0,0,4],[0,6,0,10],[0,12,0,14]]}
[2011,null,null,null,null,null,2021,null,null,null,null,null,"Difference"]
["Area","16 to 24","16 and over","SDC 16 to 24","SDC 16 and over",null,"Area","16 to 24","16 and over","SDC 16 to 24","SDC 16 and over",null,"Area","16 to 24","16 and over"]
["Aberdeen City",345.8,585.70000000000005,"*",null,null,"Aberdeen City",469.6,635.6,"*",null,null,"Aberdeen City",{"$f":"IF(OR(H3=\"*\",B3=\"*\"),\"*\",ROUND(100*((H3-B3)/B3),1))","v":35.799999999999997},{"$f":"IF(OR(I3=\"*\",C3=\"*\"),\"*\",ROUND(100*((I3-C3)/C3),1))","v":8.5}]
["Aberdeenshire",338.5,481.1,"**","*",null,"Aberdeenshire","*",584.6,"***","**",null,"Aberdeenshire",{"$f":"IF(OR(H4=\"*\",B4=\"*\"),\"*\",ROUND(100*((H4-B4)/B4),1))","v":"*"},{"$f":"IF(OR(I4=\"*\",C4=\"*\"),\"*\",ROUND(100*((I4-C4)/C4),1))","v":21.5}]
["Angus","*",416.1,"***","*",null,"Angus","*",590.29999999999995,"***","*",null,"Angus","*",41.9]
["Argyll and Bute","*",495,"***","*",null,"Argyll and Bute",422.7,556,"**","*",null,"Argyll and Bute","*",12.3]
["City of Edinburgh",307.5,526.79999999999995,"*",null,null,"City of Edinburgh",415.2,639.29999999999995,"*",null,null,"City of Edinburgh",35,21.4]
["Clackmannanshire",362.9,512.6,"**","**",null,"Clackmannanshire","*",554.70000000000005,"***","*",null,"Clackmannanshire","*",8.1999999999999993]
["Dumfries and Galloway",254.4,420.1,"**","*",null,"Dumfries and Galloway",516.29999999999995,553,"**","*",null,"Dumfries and Galloway",102.9,31.6]
["Dundee City",258.10000000000002,467.3,"**","*",null,"Dundee City",496.7,614,"**","*",null,"Dundee City",92.4,31.4]
["East Ayrshire",343.1,482.5,"**","*",null,"East Ayrshire","*",721.7,"***",null,null,"East Ayrshire","*",49.6]
["East Dunbartonshire",274.2,490.2,"**","**",null,"East Dunbartonshire","*",544.70000000000005,"***","**",null,"East Dunbartonshire","*",11.1]
["East Lothian",302.10000000000002,461.4,"**","*",null,"East Lothian","*",618.5,"***","**",null,"East Lothian","*",34]
["East Renfrewshire","*",417,"***","**",null,"East Renfrewshire","*",626.5,"***","**",null,"East Renfrewshire","*",50.2]
["Falkirk",335.1,482.1,"**","*",null,"Falkirk","*",623.5,"***","*",null,"Falkirk","*",29.3]
["Fife",267.8,435.9,"**",null,null,"Fife",441.3,599.20000000000005,"**",null,null,"Fife",64.8,37.5]
["Glasgow City",300,486.4,"*",null,null,"Glasgow City",412.9,642,"*",null,null,"Glasgow City",37.6,32]
["Highland",319.5,451.5,"**","*",null,"Highland",432.4,596.4,"**","*",null,"Highland",35.299999999999997,32.1]
["Inverclyde","*",464.4,"***","**",null,"Inverclyde",360.1,684.5,"*","**",null,"Inverclyde","*",47.4]
["Midlothian","*",487.1,"***","*",null,"Midlothian",342.1,524.4,"**","*",null,"Midlothian","*",7.7]
["Moray","*",455.6,"***","*",null,"Moray","*",579,"***","*",null,"Moray","*",27.1]
["Na h-Eileanan Siar","*",438.7,"***","**",null,"Na h-Eileanan Siar","*",669.9,"***","**",null,"Na h-Eileanan Siar","*",52.7]
["North Ayrshire",307.39999999999998,489.2,"**","*",null,"North Ayrshire","*",597.20000000000005,"***","*",null,"North Ayrshire","*",22.1]
["North Lanarkshire",318.2,475.5,"*",null,null,"North Lanarkshire",392.3,609.20000000000005,"**","*",null,"North Lanarkshire",23.3,28.1]
["Orkney Islands","*",413.3,"***","**",null,"Orkney Islands",379.9,540.9,"*","**",null,"Orkney Islands","*",30.9]
["Perth and Kinross",314.8,444.8,"**","*",null,"Perth and Kinross",393.7,632.70000000000005,"**","*",null,"Perth and Kinross",25.1,42.2]
["Renfrewshire","*",520.1,"***","*",null,"Renfrewshire","*",613,"***","*",null,"Renfrewshire","*",17.899999999999999]
["Scottish Borders",306.89999999999998,397.6,"**","*",null,"Scottish Borders",506.3,526.5,"**","*",null,"Scottish Borders",65,32.4]
["Shetland Islands","*",545.6,"***","**",null,"Shetland Islands","*",688.1,"***","**",null,"Shetland Islands","*",26.1]
["South Ayrshire",268.60000000000002,514.4,"**","*",null,"South Ayrshire",382.1,616.9,"**","*",null,"South Ayrshire",42.3,19.899999999999999]
["South Lanarkshire",287.5,479.4,"*",null,null,"South Lanarkshire",446,618.5,"**",null,null,"South Lanarkshire",55.1,29]
["Stirling","*",510.3,"***","*",null,"Stirling",326.7,649.29999999999995,"**","*",null,"Stirling","*",27.2]
["West Dunbartonshire","*",442.4,"***","**",null,"West Dunbartonshire",385.3,574.6,"**","**",null,"West Dunbartonshire","*",29.9]
["West Lothian",309.3,460.8,"**","*",null,"West Lothian",409.5,583.79999999999995,"**","*",null,"West Lothian",32.4,26.7]
["Scotland",312,485,null,null,null,"Scotland",429.4,622.4,null,null,null,"Scotland",37.6,28.3]

{"sheet":"Sector","index":9,"n_rows":166,"n_cols":7,"rows_kept":166,"cut":false,"hidden":true,"merged":[]}
["Lookup","Area","Sector","16 to 24","Rate","CI","SDC"]
[{"$f":"B2&C2","v":"Aberdeen City0. All"},"Aberdeen City","0. All",15400,0.127,2.3E-2]
[{"$f":"B3&C3","v":"Aberdeen CityA - F: Production, Agriculture & Construction"},"Aberdeen City","A - F: Production, Agriculture & Construction",1900,5.8999999999999997E-2,3.1E-2,"*"]
["Aberdeen CityG, I: Distribution, Hotels & Restaurants","Aberdeen City","G, I: Distribution, Hotels & Restaurants",8200,0.32200000000000001,7.9000000000000001E-2]
["Aberdeen CityH, J - N, R - U: Other Services","Aberdeen City","H, J - N, R - U: Other Services",3500,0.11,4.1000000000000002E-2,"*"]
["Aberdeen CityO - Q: Public Admin, Education & Health","Aberdeen City","O - Q: Public Admin, Education & Health",1400,4.4999999999999998E-2,2.7E-2,"*"]
["Aberdeenshire0. All","Aberdeenshire","0. All",15900,0.114,2.1000000000000001E-2]
["AberdeenshireA - F: Production, Agriculture & Construction","Aberdeenshire","A - F: Production, Agriculture & Construction",5000,9.6000000000000002E-2,3.2000000000000001E-2]
["AberdeenshireG, I: Distribution, Hotels & Restaurants","Aberdeenshire","G, I: Distribution, Hotels & Restaurants",6500,0.29099999999999998,7.1999999999999995E-2]
["AberdeenshireH, J - N, R - U: Other Services","Aberdeenshire","H, J - N, R - U: Other Services",1900,6.2E-2,3.4000000000000002E-2,"*"]
["AberdeenshireO - Q: Public Admin, Education & Health","Aberdeenshire","O - Q: Public Admin, Education & Health",2500,7.3999999999999996E-2,3.4000000000000002E-2,"*"]
["Angus0. All","Angus","0. All",5800,0.108,0.02]
["AngusA - F: Production, Agriculture & Construction","Angus","A - F: Production, Agriculture & Construction",1800,0.125,4.1000000000000002E-2,"*"]
["AngusG, I: Distribution, Hotels & Restaurants","Angus","G, I: Distribution, Hotels & Restaurants",2100,0.246,6.7000000000000004E-2]
["AngusH, J - N, R - U: Other Services","Angus","H, J - N, R - U: Other Services",700,5.5E-2,0.03,"*"]
["AngusO - Q: Public Admin, Education & Health","Angus","O - Q: Public Admin, Education & Health",1100,6.4000000000000001E-2,2.7E-2,"*"]
["Argyll and Bute0. All","Argyll and Bute","0. All",4500,0.113,2.1000000000000001E-2]
["Argyll and ButeA - F: Production, Agriculture & Construction","Argyll and Bute","A - F: Production, Agriculture & Construction",600,6.7000000000000004E-2,3.9E-2,"*"]
["Argyll and ButeG, I: Distribution, Hotels & Restaurants","Argyll and Bute","G, I: Distribution, Hotels & Restaurants",1800,0.26800000000000002,7.2999999999999995E-2]
["Argyll and ButeH, J - N, R - U: Other Services","Argyll and Bute","H, J - N, R - U: Other Services",1000,9.0999999999999998E-2,3.5999999999999997E-2,"*"]
["Argyll and ButeO - Q: Public Admin, Education & Health","Argyll and Bute","O - Q: Public Admin, Education & Health",1100,8.1000000000000003E-2,3.1E-2,"*"]
["City of Edinburgh0. All","City of Edinburgh","0. All",33100,0.12,1.9E-2]
["City of EdinburghA - F: Production, Agriculture & Construction","City of Edinburgh","A - F: Production, Agriculture & Construction",1800,6.5000000000000002E-2,4.3999999999999997E-2,"*"]
["City of EdinburghG, I: Distribution, Hotels & Restaurants","City of Edinburgh","G, I: Distribution, Hotels & Restaurants",17200,0.35,6.6000000000000003E-2]
["City of EdinburghH, J - N, R - U: Other Services","City of Edinburgh","H, J - N, R - U: Other Services",7200,7.0000000000000007E-2,2.4E-2,"*"]
["City of EdinburghO - Q: Public Admin, Education & Health","City of Edinburgh","O - Q: Public Admin, Education & Health",6800,7.0999999999999994E-2,2.5000000000000001E-2,"*"]
["Clackmannanshire0. All","Clackmannanshire","0. All",2200,9.1999999999999998E-2,2.5999999999999999E-2]
["ClackmannanshireA - F: Production, Agriculture & Construction","Clackmannanshire","A - F: Production, Agriculture & Construction",300,5.7000000000000002E-2,4.3999999999999997E-2,"*"]
["ClackmannanshireG, I: Distribution, Hotels & Restaurants","Clackmannanshire","G, I: Distribution, Hotels & Restaurants",900,0.23300000000000001,0.09,"*"]
["ClackmannanshireH, J - N, R - U: Other Services","Clackmannanshire","H, J - N, R - U: Other Services",700,9.6000000000000002E-2,0.05,"*"]
["ClackmannanshireO - Q: Public Admin, Education & Health","Clackmannanshire","O - Q: Public Admin, Education & Health",300,4.4999999999999998E-2,3.2000000000000001E-2,"*"]
["Dumfries and Galloway0. All","Dumfries and Galloway","0. All",6500,9.9000000000000005E-2,0.02]
["Dumfries and GallowayA - F: Production, Agriculture & Construction","Dumfries and Galloway","A - F: Production, Agriculture & Construction",1300,7.0999999999999994E-2,3.4000000000000002E-2,"*"]
["Dumfries and GallowayG, I: Distribution, Hotels & Restaurants","Dumfries and Galloway","G, I: Distribution, Hotels & Restaurants",2400,0.18099999999999999,5.8000000000000003E-2,"*"]
["Dumfries and GallowayH, J - N, R - U: Other Services","Dumfries and Galloway","H, J - N, R - U: Other Services",1700,0.12,4.7E-2,"*"]
["Dumfries and GallowayO - Q: Public Admin, Education & Health","Dumfries and Galloway","O - Q: Public Admin, Education & Health",1100,5.5E-2,2.8000000000000001E-2,"*"]
["Dundee City0. All","Dundee City","0. All",10100,0.14799999999999999,2.3E-2]
["Dundee CityA - F: Production, Agriculture & Construction","Dundee City","A - F: Production, Agriculture & Construction",900,9.1999999999999998E-2,4.9000000000000002E-2,"*"]
["Dundee CityG, I: Distribution, Hotels & Restaurants","Dundee City","G, I: Distribution, Hotels & Restaurants",4700,0.309,6.5000000000000002E-2]
["Dundee CityH, J - N, R - U: Other Services","Dundee City","H, J - N, R - U: Other Services",2100,0.112,3.9E-2]
["Dundee CityO - Q: Public Admin, Education & Health","Dundee City","O - Q: Public Admin, Education & Health",2300,9.2999999999999999E-2,3.1E-2,"*"]
["East Ayrshire0. All","East Ayrshire","0. All",6500,0.121,2.4E-2]
["East AyrshireA - F: Production, Agriculture & Construction","East Ayrshire","A - F: Production, Agriculture & Construction",1100,9.5000000000000001E-2,4.5999999999999999E-2,"*"]
["East AyrshireG, I: Distribution, Hotels & Restaurants","East Ayrshire","G, I: Distribution, Hotels & Restaurants",3200,0.309,0.08]
["East AyrshireH, J - N, R - U: Other Services","East Ayrshire","H, J - N, R - U: Other Services",1300,9.6000000000000002E-2,4.3999999999999997E-2,"*"]
["East AyrshireO - Q: Public Admin, Education & Health","East Ayrshire","O - Q: Public Admin, Education & Health",1000,5.1999999999999998E-2,2.7E-2,"*"]
["East Dunbartonshire0. All","East Dunbartonshire","0. All",5300,0.106,1.9E-2]
["East DunbartonshireA - F: Production, Agriculture & Construction","East Dunbartonshire","A - F: Production, Agriculture & Construction",900,0.123,5.2999999999999999E-2,"*"]
["East DunbartonshireG, I: Distribution, Hotels & Restaurants","East Dunbartonshire","G, I: Distribution, Hotels & Restaurants",1700,0.27100000000000002,7.8E-2]
["East DunbartonshireH, J - N, R - U: Other Services","East Dunbartonshire","H, J - N, R - U: Other Services",1300,7.8E-2,2.8000000000000001E-2]
["East DunbartonshireO - Q: Public Admin, Education & Health","East Dunbartonshire","O - Q: Public Admin, Education & Health",1200,6.6000000000000003E-2,2.4E-2,"*"]
["East Lothian0. All","East Lothian","0. All",5800,0.111,2.1000000000000001E-2]
["East LothianA - F: Production, Agriculture & Construction","East Lothian","A - F: Production, Agriculture & Construction",1100,0.11600000000000001,5.1999999999999998E-2,"*"]
["East LothianG, I: Distribution, Hotels & Restaurants","East Lothian","G, I: Distribution, Hotels & Restaurants",1800,0.20399999999999999,6.7000000000000004E-2]
["East LothianH, J - N, R - U: Other Services","East Lothian","H, J - N, R - U: Other Services",1300,0.08,3.3000000000000002E-2,"*"]
["East LothianO - Q: Public Admin, Education & Health","East Lothian","O - Q: Public Admin, Education & Health",1600,8.8999999999999996E-2,3.4000000000000002E-2,"*"]
["East Renfrewshire0. All","East Renfrewshire","0. All",3900,8.6999999999999994E-2,0.02]
["East RenfrewshireA - F: Production, Agriculture & Construction","East Renfrewshire","A - F: Production, Agriculture & Construction",300,0.04,3.6999999999999998E-2,"*"]
["East RenfrewshireG, I: Distribution, Hotels & Restaurants","East Renfrewshire","G, I: Distribution, Hotels & Restaurants",1600,0.29399999999999998,9.5000000000000001E-2]
["East RenfrewshireH, J - N, R - U: Other Services","East Renfrewshire","H, J - N, R - U: Other Services",1300,0.09,3.5999999999999997E-2,"*"]
["East RenfrewshireO - Q: Public Admin, Education & Health","East Renfrewshire","O - Q: Public Admin, Education & Health",700,4.2000000000000003E-2,2.1999999999999999E-2,"*"]
["Falkirk0. All","Falkirk","0. All",8800,0.115,2.1000000000000001E-2]
["FalkirkA - F: Production, Agriculture & Construction","Falkirk","A - F: Production, Agriculture & Construction",1000,6.5000000000000002E-2,3.5999999999999997E-2,"*"]
["FalkirkG, I: Distribution, Hotels & Restaurants","Falkirk","G, I: Distribution, Hotels & Restaurants",4900,0.314,7.2999999999999995E-2]
["FalkirkH, J - N, R - U: Other Services","Falkirk","H, J - N, R - U: Other Services",1800,0.08,3.3000000000000002E-2,"*"]
["FalkirkO - Q: Public Admin, Education & Health","Falkirk","O - Q: Public Admin, Education & Health",1100,4.4999999999999998E-2,2.5000000000000001E-2,"*"]
[{"$f":"B67&C67","v":"Fife0. All"},"Fife","0. All",20100,0.123,2.1000000000000001E-2]
["FifeA - F: Production, Agriculture & Construction","Fife","A - F: Production, Agriculture & Construction",4600,0.13600000000000001,4.9000000000000002E-2,"*"]
["FifeG, I: Distribution, Hotels & Restaurants","Fife","G, I: Distribution, Hotels & Restaurants",6300,0.22700000000000001,6.5000000000000002E-2]
["FifeH, J - N, R - U: Other Services","Fife","H, J - N, R - U: Other Services",4100,0.10199999999999999,3.7999999999999999E-2,"*"]
["FifeO - Q: Public Admin, Education & Health","Fife","O - Q: Public Admin, Education & Health",5100,8.1000000000000003E-2,2.9000000000000001E-2,"*"]
["Glasgow City0. All","Glasgow City","0. All",36200,0.12,1.9E-2]
["Glasgow CityA - F: Production, Agriculture & Construction","Glasgow City","A - F: Production, Agriculture & Construction",4400,0.107,4.9000000000000002E-2,"*"]
["Glasgow CityG, I: Distribution, Hotels & Restaurants","Glasgow City","G, I: Distribution, Hotels & Restaurants",15700,0.27900000000000003,5.8999999999999997E-2]
["Glasgow CityH, J - N, R - U: Other Services","Glasgow City","H, J - N, R - U: Other Services",10500,0.106,3.1E-2]
["Glasgow CityO - Q: Public Admin, Education & Health","Glasgow City","O - Q: Public Admin, Education & Health",5600,5.3999999999999999E-2,2.3E-2,"*"]
["Highland0. All","Highland","0. All",15000,0.125,2.5000000000000001E-2]
["HighlandA - F: Production, Agriculture & Construction","Highland","A - F: Production, Agriculture & Construction",3600,0.12,5.0999999999999997E-2,"*"]
["HighlandG, I: Distribution, Hotels & Restaurants","Highland","G, I: Distribution, Hotels & Restaurants",6000,0.23499999999999999,7.2999999999999995E-2,"*"]
["HighlandH, J - N, R - U: Other Services","Highland","H, J - N, R - U: Other Services",2800,0.105,4.8000000000000001E-2,"*"]
["HighlandO - Q: Public Admin, Education & Health","Highland","O - Q: Public Admin, Education & Health",2600,7.0000000000000007E-2,3.4000000000000002E-2,"*"]
["Inverclyde0. All","Inverclyde","0. All",4000,0.11600000000000001,2.4E-2]
["InverclydeA - F: Production, Agriculture & Construction","Inverclyde","A - F: Production, Agriculture & Construction",600,0.112,6.0999999999999999E-2,"*"]
["InverclydeG, I: Distribution, Hotels & Restaurants","Inverclyde","G, I: Distribution, Hotels & Restaurants",1600,0.27,8.1000000000000003E-2,"*"]
["InverclydeH, J - N, R - U: Other Services","Inverclyde","H, J - N, R - U: Other Services",1000,0.09,3.6999999999999998E-2,"*"]
["InverclydeO - Q: Public Admin, Education & Health","Inverclyde","O - Q: Public Admin, Education & Health",700,6.0999999999999999E-2,0.03,"*"]
["Midlothian0. All","Midlothian","0. All",4700,0.10299999999999999,2.1999999999999999E-2]
["MidlothianA - F: Production, Agriculture & Construction","Midlothian","A - F: Production, Agriculture & Construction",800,0.11799999999999999,5.8000000000000003E-2,"*"]
["MidlothianG, I: Distribution, Hotels & Restaurants","Midlothian","G, I: Distribution, Hotels & Restaurants",1800,0.22800000000000001,7.2999999999999995E-2,"*"]
["MidlothianH, J - N, R - U: Other Services","Midlothian","H, J - N, R - U: Other Services",900,6.6000000000000003E-2,3.2000000000000001E-2,"*"]
["MidlothianO - Q: Public Admin, Education & Health","Midlothian","O - Q: Public Admin, Education & Health",1100,6.9000000000000006E-2,3.1E-2,"*"]
["Moray0. All","Moray","0. All",5700,0.124,2.3E-2]
["MorayA - F: Production, Agriculture & Construction","Moray","A - F: Production, Agriculture & Construction",900,5.8999999999999997E-2,2.9000000000000001E-2,"*"]
["MorayG, I: Distribution, Hotels & Restaurants","Moray","G, I: Distribution, Hotels & Restaurants",3500,0.38300000000000001,7.9000000000000001E-2]
["MorayH, J - N, R - U: Other Services","Moray","H, J - N, R - U: Other Services",1000,0.11600000000000001,5.0999999999999997E-2,"*"]
["MorayO - Q: Public Admin, Education & Health","Moray","O - Q: Public Admin, Education & Health",300,2.1000000000000001E-2,1.9E-2,"*"]
["Na h-Eileanan Siar0. All","Na h-Eileanan Siar","0. All",1600,0.123,3.1E-2]
["Na h-Eileanan SiarA - F: Production, Agriculture & Construction","Na h-Eileanan Siar","A - F: Production, Agriculture & Construction",400,0.11899999999999999,6.0999999999999999E-2,"*"]
["Na h-Eileanan SiarG, I: Distribution, Hotels & Restaurants","Na h-Eileanan Siar","G, I: Distribution, Hotels & Restaurants",800,0.32600000000000001,0.109,"*"]
["Na h-Eileanan SiarH, J - N, R - U: Other Services","Na h-Eileanan Siar","H, J - N, R - U: Other Services",200,5.5E-2,4.4999999999999998E-2,"*"]
["Na h-Eileanan SiarO - Q: Public Admin, Education & Health","Na h-Eileanan Siar","O - Q: Public Admin, Education & Health",300,5.8000000000000003E-2,3.6999999999999998E-2,"*"]
["North Ayrshire0. All","North Ayrshire","0. All",7300,0.128,2.4E-2]
["North AyrshireA - F: Production, Agriculture & Construction","North Ayrshire","A - F: Production, Agriculture & Construction",1800,0.13700000000000001,5.1999999999999998E-2,"*"]
["North AyrshireG, I: Distribution, Hotels & Restaurants","North Ayrshire","G, I: Distribution, Hotels & Restaurants",3300,0.32,8.1000000000000003E-2]
["North AyrshireH, J - N, R - U: Other Services","North Ayrshire","H, J - N, R - U: Other Services",800,6.0999999999999999E-2,3.4000000000000002E-2,"*"]
["North AyrshireO - Q: Public Admin, Education & Health","North Ayrshire","O - Q: Public Admin, Education & Health",1300,6.4000000000000001E-2,2.9000000000000001E-2,"*"]
["North Lanarkshire0. All","North Lanarkshire","0. All",21700,0.13400000000000001,2.1999999999999999E-2]
["North LanarkshireA - F: Production, Agriculture & Construction","North Lanarkshire","A - F: Production, Agriculture & Construction",3900,0.10100000000000001,3.9E-2,"*"]
["North LanarkshireG, I: Distribution, Hotels & Restaurants","North Lanarkshire","G, I: Distribution, Hotels & Restaurants",8400,0.29099999999999998,7.1999999999999995E-2]
["North LanarkshireH, J - N, R - U: Other Services","North Lanarkshire","H, J - N, R - U: Other Services",5400,0.126,4.2000000000000003E-2,"*"]
["North LanarkshireO - Q: Public Admin, Education & Health","North Lanarkshire","O - Q: Public Admin, Education & Health",4000,7.8E-2,0.03,"*"]
["Orkney Islands0. All","Orkney Islands","0. All",1400,0.11799999999999999,5.1999999999999998E-2,"*"]
["Orkney IslandsA - F: Production, Agriculture & Construction","Orkney Islands","A - F: Production, Agriculture & Construction",500,0.14699999999999999,0.111,"*"]
["Orkney IslandsG, I: Distribution, Hotels & Restaurants","Orkney Islands","G, I: Distribution, Hotels & Restaurants",600,0.28100000000000003,0.17299999999999999,"*"]
["Orkney IslandsH, J - N, R - U: Other Services","Orkney Islands","H, J - N, R - U: Other Services",0,0,0,"***"]
["Orkney IslandsO - Q: Public Admin, Education & Health","Orkney Islands","O - Q: Public Admin, Education & Health",0,0,0,"***"]
["Perth and Kinross0. All","Perth and Kinross","0. All",9300,0.122,2.1000000000000001E-2]
["Perth and KinrossA - F: Production, Agriculture & Construction","Perth and Kinross","A - F: Production, Agriculture & Construction",2000,0.112,4.1000000000000002E-2,"*"]
["Perth and KinrossG, I: Distribution, Hotels & Restaurants","Perth and Kinross","G, I: Distribution, Hotels & Restaurants",4000,0.248,5.8999999999999997E-2]
["Perth and KinrossH, J - N, R - U: Other Services","Perth and Kinross","H, J - N, R - U: Other Services",1400,6.8000000000000005E-2,3.1E-2,"*"]
["Perth and KinrossO - Q: Public Admin, Education & Health","Perth and Kinross","O - Q: Public Admin, Education & Health",2000,8.8999999999999996E-2,3.3000000000000002E-2,"*"]
["Renfrewshire0. All","Renfrewshire","0. All",10400,0.12,2.3E-2]
["RenfrewshireA - F: Production, Agriculture & Construction","Renfrewshire","A - F: Production, Agriculture & Construction",1100,7.0999999999999994E-2,4.2999999999999997E-2,"*"]
["RenfrewshireG, I: Distribution, Hotels & Restaurants","Renfrewshire","G, I: Distribution, Hotels & Restaurants",4000,0.23400000000000001,7.0000000000000007E-2]
["RenfrewshireH, J - N, R - U: Other Services","Renfrewshire","H, J - N, R - U: Other Services",2800,0.12,4.3999999999999997E-2,"*"]
["RenfrewshireO - Q: Public Admin, Education & Health","Renfrewshire","O - Q: Public Admin, Education & Health",2400,7.6999999999999999E-2,3.1E-2,"*"]
["Scotland0. All","Scotland","0. All",315900,0.12,4.0000000000000001E-3]
["ScotlandA - F: Production, Agriculture & Construction","Scotland","A - F: Production, Agriculture & Construction",53900,0.1,8.0000000000000002E-3]
["ScotlandG, I: Distribution, Hotels & Restaurants","Scotland","G, I: Distribution, Hotels & Restaurants",133900,0.27800000000000002,1.2999999999999999E-2]
["ScotlandH, J - N, R - U: Other Services","Scotland","H, J - N, R - U: Other Services",71300,9.5000000000000001E-2,7.0000000000000001E-3]
[{"$f":"B131&C131","v":"ScotlandO - Q: Public Admin, Education & Health"},"Scotland","O - Q: Public Admin, Education & Health",54900,6.4000000000000001E-2,5.0000000000000001E-3]
["Scottish Borders0. All","Scottish Borders","0. All",5700,0.106,2.1000000000000001E-2]
["Scottish BordersA - F: Production, Agriculture & Construction","Scottish Borders","A - F: Production, Agriculture & Construction",1500,0.112,4.3999999999999997E-2,"*"]
["Scottish BordersG, I: Distribution, Hotels & Restaurants","Scottish Borders","G, I: Distribution, Hotels & Restaurants",2600,0.23200000000000001,6.4000000000000001E-2]
["Scottish BordersH, J - N, R - U: Other Services","Scottish Borders","H, J - N, R - U: Other Services",1100,7.6999999999999999E-2,3.5000000000000003E-2,"*"]
["Scottish BordersO - Q: Public Admin, Education & Health","Scottish Borders","O - Q: Public Admin, Education & Health",500,3.4000000000000002E-2,2.3E-2,"*"]
["Shetland Islands0. All","Shetland Islands","0. All",1800,0.14299999999999999,6.3E-2,"*"]
["Shetland IslandsA - F: Production, Agriculture & Construction","Shetland Islands","A - F: Production, Agriculture & Construction",600,0.16200000000000001,0.11700000000000001,"*"]
["Shetland IslandsG, I: Distribution, Hotels & Restaurants","Shetland Islands","G, I: Distribution, Hotels & Restaurants",1000,0.36,0.24299999999999999,"*"]
["Shetland IslandsH, J - N, R - U: Other Services","Shetland Islands","H, J - N, R - U: Other Services",0,0,0,"***"]
["Shetland IslandsO - Q: Public Admin, Education & Health","Shetland Islands","O - Q: Public Admin, Education & Health",0,0,0,"***"]
["South Ayrshire0. All","South Ayrshire","0. All",6500,0.13200000000000001,2.4E-2]
["South AyrshireA - F: Production, Agriculture & Construction","South Ayrshire","A - F: Production, Agriculture & Construction",1700,0.157,5.6000000000000001E-2,"*"]
["South AyrshireG, I: Distribution, Hotels & Restaurants","South Ayrshire","G, I: Distribution, Hotels & Restaurants",2700,0.26,7.6999999999999999E-2]
["South AyrshireH, J - N, R - U: Other Services","South Ayrshire","H, J - N, R - U: Other Services",1100,9.1999999999999998E-2,4.2000000000000003E-2,"*"]
["South AyrshireO - Q: Public Admin, Education & Health","South Ayrshire","O - Q: Public Admin, Education & Health",1100,6.5000000000000002E-2,2.9000000000000001E-2,"*"]
["South Lanarkshire0. All","South Lanarkshire","0. All",17600,0.111,0.02]
["South LanarkshireA - F: Production, Agriculture & Construction","South Lanarkshire","A - F: Production, Agriculture & Construction",4300,0.127,4.4999999999999998E-2,"*"]
["South LanarkshireG, I: Distribution, Hotels & Restaurants","South Lanarkshire","G, I: Distribution, Hotels & Restaurants",5200,0.21,6.7000000000000004E-2,"*"]
["South LanarkshireH, J - N, R - U: Other Services","South Lanarkshire","H, J - N, R - U: Other Services",6400,0.122,3.6999999999999998E-2,"*"]
["South LanarkshireO - Q: Public Admin, Education & Health","South Lanarkshire","O - Q: Public Admin, Education & Health",1600,3.5000000000000003E-2,2.1000000000000001E-2,"*"]
["Stirling0. All","Stirling","0. All",7500,0.16600000000000001,2.5999999999999999E-2]
["StirlingA - F: Production, Agriculture & Construction","Stirling","A - F: Production, Agriculture & Construction",600,0.09,4.8000000000000001E-2,"*"]
["StirlingG, I: Distribution, Hotels & Restaurants","Stirling","G, I: Distribution, Hotels & Restaurants",4000,0.36399999999999999,7.1999999999999995E-2]
["StirlingH, J - N, R - U: Other Services","Stirling","H, J - N, R - U: Other Services",1800,0.13400000000000001,4.2999999999999997E-2,"*"]
["StirlingO - Q: Public Admin, Education & Health","Stirling","O - Q: Public Admin, Education & Health",900,7.0000000000000007E-2,3.1E-2,"*"]
["West Dunbartonshire0. All","West Dunbartonshire","0. All",4900,0.11700000000000001,0.02]
["West DunbartonshireA - F: Production, Agriculture & Construction","West Dunbartonshire","A - F: Production, Agriculture & Construction",700,0.09,4.2999999999999997E-2,"*"]
["West DunbartonshireG, I: Distribution, Hotels & Restaurants","West Dunbartonshire","G, I: Distribution, Hotels & Restaurants",2000,0.32200000000000001,7.6999999999999999E-2]
["West DunbartonshireH, J - N, R - U: Other Services","West Dunbartonshire","H, J - N, R - U: Other Services",1100,9.5000000000000001E-2,3.5999999999999997E-2,"*"]
["West DunbartonshireO - Q: Public Admin, Education & Health","West Dunbartonshire","O - Q: Public Admin, Education & Health",1100,6.7000000000000004E-2,2.5000000000000001E-2,"*"]
["West Lothian0. All","West Lothian","0. All",10600,0.11799999999999999,2.1000000000000001E-2]
["West LothianA - F: Production, Agriculture & Construction","West Lothian","A - F: Production, Agriculture & Construction",2000,0.112,4.7E-2,"*"]
["West LothianG, I: Distribution, Hotels & Restaurants","West Lothian","G, I: Distribution, Hotels & Restaurants",3800,0.22800000000000001,6.5000000000000002E-2]
["West LothianH, J - N, R - U: Other Services","West Lothian","H, J - N, R - U: Other Services",2900,9.5000000000000001E-2,3.4000000000000002E-2,"*"]
["West LothianO - Q: Public Admin, Education & Health","West Lothian","O - Q: Public Admin, Education & Health",1900,7.4999999999999997E-2,3.3000000000000002E-2,"*"]

{"sheet":"Qualifications","index":10,"n_rows":100,"n_cols":7,"rows_kept":100,"cut":false,"hidden":true,"merged":[]}
["Lookup","Area","Qualification","Level","Rate","CI","SDC"]
[{"$f":"B2&C2","v":"Scotland1: SVQ Level 4 and 5"},"Scotland","1: SVQ Level 4 and 5",109500,0.75600000000000001,2.7E-2]
["Scotland2: SVQ Level 2 and 3","Scotland","2: SVQ Level 2 and 3",170700,0.51600000000000001,1.9E-2]
["Scotland3: SVQ Level 1 and None","Scotland","3: SVQ Level 1 and None",18700,0.32700000000000001,4.2000000000000003E-2]
["Aberdeen City1: SVQ Level 4 and 5","Aberdeen City","1: SVQ Level 4 and 5",7000,0.80200000000000005,0.14000000000000001,"*"]
["Aberdeen City2: SVQ Level 2 and 3","Aberdeen City","2: SVQ Level 2 and 3",6700,0.43099999999999999,0.11899999999999999]
["Aberdeen City3: SVQ Level 1 and None","Aberdeen City","3: SVQ Level 1 and None",800,0.28999999999999998,0.222,"*"]
["Aberdeenshire1: SVQ Level 4 and 5","Aberdeenshire","1: SVQ Level 4 and 5",5300,0.76300000000000001,0.14499999999999999,"*"]
["Aberdeenshire2: SVQ Level 2 and 3","Aberdeenshire","2: SVQ Level 2 and 3",9300,0.65400000000000003,0.105]
["Aberdeenshire3: SVQ Level 1 and None","Aberdeenshire","3: SVQ Level 1 and None",500,0.443,0.32500000000000001,"*"]
["Angus1: SVQ Level 4 and 5","Angus","1: SVQ Level 4 and 5",1500,0.64800000000000002,0.16500000000000001,"*"]
["Angus2: SVQ Level 2 and 3","Angus","2: SVQ Level 2 and 3",3800,0.58299999999999996,9.7000000000000003E-2]
["Angus3: SVQ Level 1 and None","Angus","3: SVQ Level 1 and None",400,0.23400000000000001,0.154,"*"]
["Argyll and Bute1: SVQ Level 4 and 5","Argyll and Bute","1: SVQ Level 4 and 5",1200,0.85799999999999998,".","*"]
["Argyll and Bute2: SVQ Level 2 and 3","Argyll and Bute","2: SVQ Level 2 and 3",2700,0.57999999999999996,0.11600000000000001]
["Argyll and Bute3: SVQ Level 1 and None","Argyll and Bute","3: SVQ Level 1 and None",300,0.27300000000000002,0.24199999999999999,"*"]
["City of Edinburgh1: SVQ Level 4 and 5","City of Edinburgh","1: SVQ Level 4 and 5",16000,0.78,0.105]
["City of Edinburgh2: SVQ Level 2 and 3","City of Edinburgh","2: SVQ Level 2 and 3",14500,0.40200000000000002,8.5000000000000006E-2]
["City of Edinburgh3: SVQ Level 1 and None","City of Edinburgh","3: SVQ Level 1 and None",1300,0.38800000000000001,0.23899999999999999,"*"]
["Clackmannanshire1: SVQ Level 4 and 5","Clackmannanshire","1: SVQ Level 4 and 5",300,0.76600000000000001,".","*"]
["Clackmannanshire2: SVQ Level 2 and 3","Clackmannanshire","2: SVQ Level 2 and 3",1600,0.629,0.12]
["Clackmannanshire3: SVQ Level 1 and None","Clackmannanshire","3: SVQ Level 1 and None",0,0,0,"***"]
["Dumfries and Galloway1: SVQ Level 4 and 5","Dumfries and Galloway","1: SVQ Level 4 and 5",1200,0.65600000000000003,0.249,"*"]
["Dumfries and Galloway2: SVQ Level 2 and 3","Dumfries and Galloway","2: SVQ Level 2 and 3",5100,0.52100000000000002,0.106]
["Dumfries and Galloway3: SVQ Level 1 and None","Dumfries and Galloway","3: SVQ Level 1 and None",0,0,0,"***"]
["Dundee City1: SVQ Level 4 and 5","Dundee City","1: SVQ Level 4 and 5",4000,0.73,0.111]
["Dundee City2: SVQ Level 2 and 3","Dundee City","2: SVQ Level 2 and 3",5300,0.43099999999999999,8.3000000000000004E-2]
["Dundee City3: SVQ Level 1 and None","Dundee City","3: SVQ Level 1 and None",700,0.44,0.19900000000000001,"*"]
["East Ayrshire1: SVQ Level 4 and 5","East Ayrshire","1: SVQ Level 4 and 5",1900,0.86,0.13900000000000001,"*"]
["East Ayrshire2: SVQ Level 2 and 3","East Ayrshire","2: SVQ Level 2 and 3",3600,0.56799999999999995,0.114]
["East Ayrshire3: SVQ Level 1 and None","East Ayrshire","3: SVQ Level 1 and None",300,0.15,0.14299999999999999,"*"]
["East Dunbartonshire1: SVQ Level 4 and 5","East Dunbartonshire","1: SVQ Level 4 and 5",1900,0.77100000000000002,0.123]
["East Dunbartonshire2: SVQ Level 2 and 3","East Dunbartonshire","2: SVQ Level 2 and 3",2800,0.45700000000000002,9.0999999999999998E-2]
[{"$f":"B34&C34","v":"East Dunbartonshire3: SVQ Level 1 and None"},"East Dunbartonshire","3: SVQ Level 1 and None",300,0.25800000000000001,0.20200000000000001,"*"]
["East Lothian1: SVQ Level 4 and 5","East Lothian","1: SVQ Level 4 and 5",1900,0.84799999999999998,".","*"]
["East Lothian2: SVQ Level 2 and 3","East Lothian","2: SVQ Level 2 and 3",2900,0.51400000000000001,0.114]
["East Lothian3: SVQ Level 1 and None","East Lothian","3: SVQ Level 1 and None",300,0.27900000000000003,0.24399999999999999,"*"]
["East Renfrewshire1: SVQ Level 4 and 5","East Renfrewshire","1: SVQ Level 4 and 5",1500,0.68899999999999995,0.16600000000000001,"*"]
["East Renfrewshire2: SVQ Level 2 and 3","East Renfrewshire","2: SVQ Level 2 and 3",2100,0.32400000000000001,8.8999999999999996E-2]
["East Renfrewshire3: SVQ Level 1 and None","East Renfrewshire","3: SVQ Level 1 and None",0,0,0,"***"]
["Falkirk1: SVQ Level 4 and 5","Falkirk","1: SVQ Level 4 and 5",2500,0.97,".","*"]
["Falkirk2: SVQ Level 2 and 3","Falkirk","2: SVQ Level 2 and 3",4700,0.54800000000000004,0.112]
["Falkirk3: SVQ Level 1 and None","Falkirk","3: SVQ Level 1 and None",700,0.29199999999999998,0.186,"*"]
["Fife1: SVQ Level 4 and 5","Fife","1: SVQ Level 4 and 5",7600,0.69699999999999995,0.14399999999999999]
["Fife2: SVQ Level 2 and 3","Fife","2: SVQ Level 2 and 3",10600,0.51400000000000001,0.104]
["Fife3: SVQ Level 1 and None","Fife","3: SVQ Level 1 and None",1800,0.35399999999999998,0.20399999999999999,"*"]
["Glasgow City1: SVQ Level 4 and 5","Glasgow City","1: SVQ Level 4 and 5",15300,0.58299999999999996,0.10100000000000001]
["Glasgow City2: SVQ Level 2 and 3","Glasgow City","2: SVQ Level 2 and 3",15600,0.443,8.1000000000000003E-2]
["Glasgow City3: SVQ Level 1 and None","Glasgow City","3: SVQ Level 1 and None",1600,0.21299999999999999,0.14699999999999999,"*"]
["Highland1: SVQ Level 4 and 5","Highland","1: SVQ Level 4 and 5",".",".","."]
["Highland2: SVQ Level 2 and 3","Highland","2: SVQ Level 2 and 3",10300,0.68600000000000005,0.129]
["Highland3: SVQ Level 1 and None","Highland","3: SVQ Level 1 and None",700,0.432,0.39600000000000002,"*"]
["Inverclyde1: SVQ Level 4 and 5","Inverclyde","1: SVQ Level 4 and 5",500,0.496,0.245,"*"]
["Inverclyde2: SVQ Level 2 and 3","Inverclyde","2: SVQ Level 2 and 3",2600,0.496,0.113]
["Inverclyde3: SVQ Level 1 and None","Inverclyde","3: SVQ Level 1 and None",0,0,0,"***"]
["Midlothian1: SVQ Level 4 and 5","Midlothian","1: SVQ Level 4 and 5",1200,0.76200000000000001,0.216,"*"]
["Midlothian2: SVQ Level 2 and 3","Midlothian","2: SVQ Level 2 and 3",2800,0.51100000000000001,0.11899999999999999]
["Midlothian3: SVQ Level 1 and None","Midlothian","3: SVQ Level 1 and None",200,0.27200000000000002,".","*"]
["Moray1: SVQ Level 4 and 5","Moray","1: SVQ Level 4 and 5",1700,0.73099999999999998,0.17699999999999999,"*"]
["Moray2: SVQ Level 2 and 3","Moray","2: SVQ Level 2 and 3",3300,0.61799999999999999,0.11]
["Moray3: SVQ Level 1 and None","Moray","3: SVQ Level 1 and None",500,0.38300000000000001,0.23799999999999999,"*"]
["Na h-Eileanan Siar1: SVQ Level 4 and 5","Na h-Eileanan Siar","1: SVQ Level 4 and 5",300,0.71299999999999997,".","*"]
["Na h-Eileanan Siar2: SVQ Level 2 and 3","Na h-Eileanan Siar","2: SVQ Level 2 and 3",1100,0.67800000000000005,0.16200000000000001,"*"]
["Na h-Eileanan Siar3: SVQ Level 1 and None","Na h-Eileanan Siar","3: SVQ Level 1 and None",100,0.90800000000000003,".","*"]
["North Ayrshire1: SVQ Level 4 and 5","North Ayrshire","1: SVQ Level 4 and 5",2200,0.79600000000000004,0.152,"*"]
[{"$f":"B66&C66","v":"North Ayrshire2: SVQ Level 2 and 3"},"North Ayrshire","2: SVQ Level 2 and 3",4400,0.53800000000000003,0.11700000000000001]
["North Ayrshire3: SVQ Level 1 and None","North Ayrshire","3: SVQ Level 1 and None",500,0.307,0.23400000000000001,"*"]
["North Lanarkshire1: SVQ Level 4 and 5","North Lanarkshire","1: SVQ Level 4 and 5",7000,0.84499999999999997,0.107]
["North Lanarkshire2: SVQ Level 2 and 3","North Lanarkshire","2: SVQ Level 2 and 3",12700,0.59599999999999997,9.4E-2]
["North Lanarkshire3: SVQ Level 1 and None","North Lanarkshire","3: SVQ Level 1 and None",1700,0.35299999999999998,0.19500000000000001,"*"]
["Orkney Islands1: SVQ Level 4 and 5","Orkney Islands","1: SVQ Level 4 and 5",0,0,0,"***"]
["Orkney Islands2: SVQ Level 2 and 3","Orkney Islands","2: SVQ Level 2 and 3",1000,0.82,".","*"]
["Orkney Islands3: SVQ Level 1 and None","Orkney Islands","3: SVQ Level 1 and None",0,0,0,"***"]
["Perth and Kinross1: SVQ Level 4 and 5","Perth and Kinross","1: SVQ Level 4 and 5",3300,0.86199999999999999,0.10100000000000001]
["Perth and Kinross2: SVQ Level 2 and 3","Perth and Kinross","2: SVQ Level 2 and 3",4900,0.63700000000000001,9.7000000000000003E-2]
["Perth and Kinross3: SVQ Level 1 and None","Perth and Kinross","3: SVQ Level 1 and None",300,0.20499999999999999,0.182,"*"]
["Renfrewshire1: SVQ Level 4 and 5","Renfrewshire","1: SVQ Level 4 and 5",3600,0.88500000000000001,0.106]
["Renfrewshire2: SVQ Level 2 and 3","Renfrewshire","2: SVQ Level 2 and 3",5700,0.498,9.8000000000000004E-2]
["Renfrewshire3: SVQ Level 1 and None","Renfrewshire","3: SVQ Level 1 and None",300,0.28399999999999997,0.255,"*"]
["Scottish Borders1: SVQ Level 4 and 5","Scottish Borders","1: SVQ Level 4 and 5",1500,0.74299999999999999,0.17899999999999999,"*"]
["Scottish Borders2: SVQ Level 2 and 3","Scottish Borders","2: SVQ Level 2 and 3",3600,0.55600000000000005,0.104]
["Scottish Borders3: SVQ Level 1 and None","Scottish Borders","3: SVQ Level 1 and None",400,0.34399999999999997,0.22600000000000001,"*"]
["Shetland Islands1: SVQ Level 4 and 5","Shetland Islands","1: SVQ Level 4 and 5",0,0,0,"***"]
["Shetland Islands2: SVQ Level 2 and 3","Shetland Islands","2: SVQ Level 2 and 3",1200,0.58599999999999997,0.36499999999999999,"*"]
["Shetland Islands3: SVQ Level 1 and None","Shetland Islands","3: SVQ Level 1 and None",0,0,0,"***"]
["South Ayrshire1: SVQ Level 4 and 5","South Ayrshire","1: SVQ Level 4 and 5",2400,0.82099999999999995,0.13700000000000001,"*"]
["South Ayrshire2: SVQ Level 2 and 3","South Ayrshire","2: SVQ Level 2 and 3",3300,0.54800000000000004,0.11899999999999999]
["South Ayrshire3: SVQ Level 1 and None","South Ayrshire","3: SVQ Level 1 and None",500,0.60599999999999998,0.33900000000000002,"*"]
["South Lanarkshire1: SVQ Level 4 and 5","South Lanarkshire","1: SVQ Level 4 and 5",5000,0.83399999999999996,0.14599999999999999,"*"]
["South Lanarkshire2: SVQ Level 2 and 3","South Lanarkshire","2: SVQ Level 2 and 3",10200,0.498,9.9000000000000005E-2]
["South Lanarkshire3: SVQ Level 1 and None","South Lanarkshire","3: SVQ Level 1 and None",2000,0.60799999999999998,0.25600000000000001,"*"]
["Stirling1: SVQ Level 4 and 5","Stirling","1: SVQ Level 4 and 5",2800,0.82699999999999996,0.13100000000000001]
["Stirling2: SVQ Level 2 and 3","Stirling","2: SVQ Level 2 and 3",4400,0.56100000000000005,0.106]
["Stirling3: SVQ Level 1 and None","Stirling","3: SVQ Level 1 and None",200,0.27600000000000002,0.253,"*"]
["West Dunbartonshire1: SVQ Level 4 and 5","West Dunbartonshire","1: SVQ Level 4 and 5",2100,0.78800000000000003,0.11899999999999999]
["West Dunbartonshire2: SVQ Level 2 and 3","West Dunbartonshire","2: SVQ Level 2 and 3",2500,0.55600000000000005,0.107]
["West Dunbartonshire3: SVQ Level 1 and None","West Dunbartonshire","3: SVQ Level 1 and None",0,0,0,"***"]
[{"$f":"B98&C98","v":"West Lothian1: SVQ Level 4 and 5"},"West Lothian","1: SVQ Level 4 and 5",3400,0.877,".","*"]
["West Lothian2: SVQ Level 2 and 3","West Lothian","2: SVQ Level 2 and 3",5300,0.51800000000000002,0.104]
["West Lothian3: SVQ Level 1 and None","West Lothian","3: SVQ Level 1 and None",1300,0.40200000000000002,0.185,"*"]

{"sheet":"Education","index":11,"n_rows":199,"n_cols":8,"rows_kept":199,"cut":false,"hidden":true,"merged":[]}
["Lookup","Area","Status","Education","Level","Rate","CI","SDC"]
[{"$f":"B2&C2&D2","v":"Aberdeen CityEmployedAll"},"Aberdeen City","Employed","All",15400,0.54300000000000004,0.09]
["Aberdeen CityInactiveAll","Aberdeen City","Inactive","All",10900,0.38300000000000001,8.7999999999999995E-2]
["Aberdeen CityILO UnemployedAll","Aberdeen City","ILO Unemployed","All",2100,0.12,7.2999999999999995E-2,"*"]
["Aberdeen CityILO UnemployedNot Full-Time Education","Aberdeen City","ILO Unemployed","Not Full-Time Education",1100,0.126,9.7000000000000003E-2,"*"]
["Aberdeen CityInactiveNot Full-Time Education","Aberdeen City","Inactive","Not Full-Time Education",3200,0.26500000000000001,0.114,"*"]
["Aberdeen CityEmployedNot Full-Time Education","Aberdeen City","Employed","Not Full-Time Education",7700,0.64200000000000002,0.123]
["AberdeenshireILO UnemployedAll","Aberdeenshire","ILO Unemployed","All",700,4.2000000000000003E-2,4.1000000000000002E-2,"*"]
["AberdeenshireEmployedAll","Aberdeenshire","Employed","All",15900,0.67700000000000005,0.08]
["AberdeenshireInactiveAll","Aberdeenshire","Inactive","All",6900,0.29399999999999998,7.8E-2]
["AberdeenshireInactiveNot Full-Time Education","Aberdeenshire","Inactive","Not Full-Time Education",700,5.5E-2,".","*"]
["AberdeenshireEmployedNot Full-Time Education","Aberdeenshire","Employed","Not Full-Time Education",11000,0.88900000000000001,7.4999999999999997E-2]
["AberdeenshireILO UnemployedNot Full-Time Education","Aberdeenshire","ILO Unemployed","Not Full-Time Education",700,5.8999999999999997E-2,".","*"]
["AngusILO UnemployedAll","Angus","ILO Unemployed","All",500,8.2000000000000003E-2,5.6000000000000001E-2,"*"]
["AngusInactiveAll","Angus","Inactive","All",4400,0.41,7.4999999999999997E-2]
["AngusEmployedAll","Angus","Employed","All",5800,0.54100000000000004,7.5999999999999998E-2]
["AngusEmployedNot Full-Time Education","Angus","Employed","Not Full-Time Education",4200,0.72899999999999998,9.6000000000000002E-2]
["AngusILO UnemployedNot Full-Time Education","Angus","ILO Unemployed","Not Full-Time Education",300,6.3E-2,0.06,"*"]
["AngusInactiveNot Full-Time Education","Angus","Inactive","Not Full-Time Education",1300,0.221,0.09,"*"]
["Argyll and ButeEmployedAll","Argyll and Bute","Employed","All",4500,0.59299999999999997,9.1999999999999998E-2]
["Argyll and ButeInactiveAll","Argyll and Bute","Inactive","All",2800,0.376,9.0999999999999998E-2]
["Argyll and ButeILO UnemployedAll","Argyll and Bute","ILO Unemployed","All",200,0.05,".","*"]
["Argyll and ButeInactiveNot Full-Time Education","Argyll and Bute","Inactive","Not Full-Time Education",900,0.19900000000000001,9.8000000000000004E-2,"*"]
["Argyll and ButeILO UnemployedNot Full-Time Education","Argyll and Bute","ILO Unemployed","Not Full-Time Education",200,4.3999999999999997E-2,".","*"]
["Argyll and ButeEmployedNot Full-Time Education","Argyll and Bute","Employed","Not Full-Time Education",3600,0.76600000000000001,0.104]
["City of EdinburghILO UnemployedAll","City of Edinburgh","ILO Unemployed","All",2700,7.3999999999999996E-2,4.9000000000000002E-2,"*"]
["City of EdinburghInactiveAll","City of Edinburgh","Inactive","All",26400,0.42399999999999999,6.7000000000000004E-2]
["City of EdinburghEmployedAll","City of Edinburgh","Employed","All",33100,0.53300000000000003,6.7000000000000004E-2]
["City of EdinburghInactiveNot Full-Time Education","City of Edinburgh","Inactive","Not Full-Time Education",5200,0.189,7.9000000000000001E-2,"*"]
["City of EdinburghEmployedNot Full-Time Education","City of Edinburgh","Employed","Not Full-Time Education",20900,0.76100000000000001,8.5999999999999993E-2]
["City of EdinburghILO UnemployedNot Full-Time Education","City of Edinburgh","ILO Unemployed","Not Full-Time Education",1400,6.2E-2,5.5E-2,"*"]
["ClackmannanshireInactiveAll","Clackmannanshire","Inactive","All",1200,0.32600000000000001,9.8000000000000004E-2]
["ClackmannanshireILO UnemployedAll","Clackmannanshire","ILO Unemployed","All",300,0.112,8.4000000000000005E-2,"*"]
[{"$f":"B34&C34&D34","v":"ClackmannanshireEmployedAll"},"Clackmannanshire","Employed","All",2200,0.59899999999999998,0.10199999999999999]
["ClackmannanshireILO UnemployedNot Full-Time Education","Clackmannanshire","ILO Unemployed","Not Full-Time Education",200,0.127,0.10199999999999999,"*"]
["ClackmannanshireEmployedNot Full-Time Education","Clackmannanshire","Employed","Not Full-Time Education",1600,0.77400000000000002,0.121]
["ClackmannanshireInactiveNot Full-Time Education","Clackmannanshire","Inactive","Not Full-Time Education",200,0.113,9.1999999999999998E-2,"*"]
["Dumfries and GallowayInactiveAll","Dumfries and Galloway","Inactive","All",5700,0.44,9.0999999999999998E-2]
["Dumfries and GallowayEmployedAll","Dumfries and Galloway","Employed","All",6500,0.496,9.1999999999999998E-2]
["Dumfries and GallowayILO UnemployedAll","Dumfries and Galloway","ILO Unemployed","All",800,0.115,7.9000000000000001E-2,"*"]
["Dumfries and GallowayEmployedNot Full-Time Education","Dumfries and Galloway","Employed","Not Full-Time Education",5400,0.68799999999999994,0.113]
["Dumfries and GallowayILO UnemployedNot Full-Time Education","Dumfries and Galloway","ILO Unemployed","Not Full-Time Education",800,0.13400000000000001,9.2999999999999999E-2,"*"]
["Dumfries and GallowayInactiveNot Full-Time Education","Dumfries and Galloway","Inactive","Not Full-Time Education",1600,0.20499999999999999,9.8000000000000004E-2,"*"]
["Dundee CityInactiveAll","Dundee City","Inactive","All",8100,0.40600000000000003,6.3E-2]
["Dundee CityILO UnemployedAll","Dundee City","ILO Unemployed","All",1700,0.14399999999999999,5.8000000000000003E-2,"*"]
["Dundee CityEmployedAll","Dundee City","Employed","All",10100,0.50800000000000001,6.4000000000000001E-2]
["Dundee CityInactiveNot Full-Time Education","Dundee City","Inactive","Not Full-Time Education",900,0.11799999999999999,6.5000000000000002E-2,"*"]
["Dundee CityILO UnemployedNot Full-Time Education","Dundee City","ILO Unemployed","Not Full-Time Education",600,9.1999999999999998E-2,6.2E-2,"*"]
["Dundee CityEmployedNot Full-Time Education","Dundee City","Employed","Not Full-Time Education",6300,0.80100000000000005,0.08]
["East AyrshireEmployedAll","East Ayrshire","Employed","All",6500,0.56000000000000005,8.5000000000000006E-2]
["East AyrshireILO UnemployedAll","East Ayrshire","ILO Unemployed","All",900,0.11899999999999999,7.0000000000000007E-2,"*"]
["East AyrshireInactiveAll","East Ayrshire","Inactive","All",4200,0.36399999999999999,8.2000000000000003E-2]
["East AyrshireEmployedNot Full-Time Education","East Ayrshire","Employed","Not Full-Time Education",5300,0.73699999999999999,9.8000000000000004E-2]
["East AyrshireInactiveNot Full-Time Education","East Ayrshire","Inactive","Not Full-Time Education",1100,0.14699999999999999,7.9000000000000001E-2,"*"]
["East AyrshireILO UnemployedNot Full-Time Education","East Ayrshire","ILO Unemployed","Not Full-Time Education",800,0.13700000000000001,8.3000000000000004E-2,"*"]
["East DunbartonshireILO UnemployedAll","East Dunbartonshire","ILO Unemployed","All",0,0,0,"***"]
["East DunbartonshireEmployedAll","East Dunbartonshire","Employed","All",5300,0.51300000000000001,7.0999999999999994E-2]
["East DunbartonshireInactiveAll","East Dunbartonshire","Inactive","All",5000,0.48199999999999998,7.0999999999999994E-2]
["East DunbartonshireInactiveNot Full-Time Education","East Dunbartonshire","Inactive","Not Full-Time Education",1100,0.22900000000000001,8.5000000000000006E-2,"*"]
["East DunbartonshireILO UnemployedNot Full-Time Education","East Dunbartonshire","ILO Unemployed","Not Full-Time Education",0,0,0,"***"]
["East DunbartonshireEmployedNot Full-Time Education","East Dunbartonshire","Employed","Not Full-Time Education",3800,0.77100000000000002,8.5000000000000006E-2]
["East LothianILO UnemployedAll","East Lothian","ILO Unemployed","All",600,0.09,6.5000000000000002E-2,"*"]
["East LothianInactiveAll","East Lothian","Inactive","All",3500,0.35699999999999998,8.6999999999999994E-2]
["East LothianEmployedAll","East Lothian","Employed","All",5800,0.58499999999999996,8.8999999999999996E-2]
["East LothianInactiveNot Full-Time Education","East Lothian","Inactive","Not Full-Time Education",1000,0.19,9.9000000000000005E-2,"*"]
[{"$f":"B66&C66&D66","v":"East LothianILO UnemployedNot Full-Time Education"},"East Lothian","ILO Unemployed","Not Full-Time Education",500,0.10199999999999999,8.4000000000000005E-2,"*"]
["East LothianEmployedNot Full-Time Education","East Lothian","Employed","Not Full-Time Education",4000,0.72699999999999998,0.113]
["East RenfrewshireILO UnemployedAll","East Renfrewshire","ILO Unemployed","All",400,0.1,7.1999999999999995E-2,"*"]
["East RenfrewshireInactiveAll","East Renfrewshire","Inactive","All",5300,0.55600000000000005,7.8E-2]
["East RenfrewshireEmployedAll","East Renfrewshire","Employed","All",3900,0.4,7.6999999999999999E-2]
["East RenfrewshireInactiveNot Full-Time Education","East Renfrewshire","Inactive","Not Full-Time Education",600,0.182,0.10299999999999999,"*"]
["East RenfrewshireILO UnemployedNot Full-Time Education","East Renfrewshire","ILO Unemployed","Not Full-Time Education",300,0.11,9.5000000000000001E-2,"*"]
["East RenfrewshireEmployedNot Full-Time Education","East Renfrewshire","Employed","Not Full-Time Education",2600,0.72799999999999998,0.11899999999999999]
["FalkirkInactiveAll","Falkirk","Inactive","All",5200,0.33600000000000002,0.08]
["FalkirkEmployedAll","Falkirk","Employed","All",8800,0.57299999999999995,8.4000000000000005E-2]
["FalkirkILO UnemployedAll","Falkirk","ILO Unemployed","All",1400,0.13700000000000001,7.3999999999999996E-2,"*"]
["FalkirkEmployedNot Full-Time Education","Falkirk","Employed","Not Full-Time Education",7400,0.69299999999999995,0.10100000000000001]
["FalkirkInactiveNot Full-Time Education","Falkirk","Inactive","Not Full-Time Education",2100,0.193,8.5999999999999993E-2,"*"]
["FalkirkILO UnemployedNot Full-Time Education","Falkirk","ILO Unemployed","Not Full-Time Education",1200,0.14099999999999999,8.3000000000000004E-2,"*"]
["FifeInactiveAll","Fife","Inactive","All",17100,0.436,7.8E-2]
["FifeILO UnemployedAll","Fife","ILO Unemployed","All",2100,9.2999999999999999E-2,0.06,"*"]
["FifeEmployedAll","Fife","Employed","All",20100,0.51200000000000001,7.8E-2]
["FifeInactiveNot Full-Time Education","Fife","Inactive","Not Full-Time Education",4100,0.17599999999999999,7.9000000000000001E-2,"*"]
["FifeILO UnemployedNot Full-Time Education","Fife","ILO Unemployed","Not Full-Time Education",1900,0.10199999999999999,6.8000000000000005E-2,"*"]
["FifeEmployedNot Full-Time Education","Fife","Employed","Not Full-Time Education",17200,0.74,9.0999999999999998E-2]
["Glasgow CityInactiveAll","Glasgow City","Inactive","All",36400,0.47499999999999998,5.7000000000000002E-2]
["Glasgow CityEmployedAll","Glasgow City","Employed","All",36200,0.47299999999999998,5.7000000000000002E-2]
["Glasgow CityILO UnemployedAll","Glasgow City","ILO Unemployed","All",3900,9.8000000000000004E-2,4.7E-2,"*"]
["Glasgow CityInactiveNot Full-Time Education","Glasgow City","Inactive","Not Full-Time Education",12300,0.309,7.8E-2]
["Glasgow CityILO UnemployedNot Full-Time Education","Glasgow City","ILO Unemployed","Not Full-Time Education",2100,7.8E-2,5.2999999999999999E-2,"*"]
["Glasgow CityEmployedNot Full-Time Education","Glasgow City","Employed","Not Full-Time Education",25300,0.63700000000000001,8.1000000000000003E-2]
["HighlandInactiveAll","Highland","Inactive","All",5700,0.27,0.105,"*"]
["HighlandILO UnemployedAll","Highland","ILO Unemployed","All",0,0,0,"***"]
["HighlandEmployedAll","Highland","Employed","All",15000,0.71599999999999997,0.106]
["HighlandInactiveNot Full-Time Education","Highland","Inactive","Not Full-Time Education",1200,9.4E-2,8.7999999999999995E-2,"*"]
["HighlandILO UnemployedNot Full-Time Education","Highland","ILO Unemployed","Not Full-Time Education",0,0,0,"***"]
["HighlandEmployedNot Full-Time Education","Highland","Employed","Not Full-Time Education",11800,0.90600000000000003,8.7999999999999995E-2]
[{"$f":"B98&C98&D98","v":"InverclydeInactiveAll"},"Inverclyde","Inactive","All",3100,0.41399999999999998,9.2999999999999999E-2]
["InverclydeILO UnemployedAll","Inverclyde","ILO Unemployed","All",500,0.111,7.5999999999999998E-2,"*"]
["InverclydeEmployedAll","Inverclyde","Employed","All",4000,0.52100000000000002,9.5000000000000001E-2]
["InverclydeInactiveNot Full-Time Education","Inverclyde","Inactive","Not Full-Time Education",600,0.152,9.4E-2,"*"]
["InverclydeEmployedNot Full-Time Education","Inverclyde","Employed","Not Full-Time Education",3000,0.749,0.113]
["InverclydeILO UnemployedNot Full-Time Education","Inverclyde","ILO Unemployed","Not Full-Time Education",400,0.11600000000000001,9.0999999999999998E-2,"*"]
["MidlothianInactiveAll","Midlothian","Inactive","All",3200,0.38100000000000001,9.6000000000000002E-2]
["MidlothianILO UnemployedAll","Midlothian","ILO Unemployed","All",600,0.106,7.6999999999999999E-2,"*"]
["MidlothianEmployedAll","Midlothian","Employed","All",4700,0.55400000000000005,9.8000000000000004E-2]
["MidlothianInactiveNot Full-Time Education","Midlothian","Inactive","Not Full-Time Education",500,0.126,0.09,"*"]
["MidlothianILO UnemployedNot Full-Time Education","Midlothian","ILO Unemployed","Not Full-Time Education",200,6.0999999999999999E-2,".","*"]
["MidlothianEmployedNot Full-Time Education","Midlothian","Employed","Not Full-Time Education",3500,0.82,0.104]
["MorayInactiveAll","Moray","Inactive","All",3000,0.33300000000000002,8.5000000000000006E-2]
["MorayILO UnemployedAll","Moray","ILO Unemployed","All",400,6.6000000000000003E-2,5.6000000000000001E-2,"*"]
["MorayEmployedAll","Moray","Employed","All",5700,0.624,8.6999999999999994E-2]
["MorayInactiveNot Full-Time Education","Moray","Inactive","Not Full-Time Education",1300,0.20799999999999999,9.2999999999999999E-2,"*"]
["MorayILO UnemployedNot Full-Time Education","Moray","ILO Unemployed","Not Full-Time Education",400,0.08,7.0000000000000007E-2,"*"]
["MorayEmployedNot Full-Time Education","Moray","Employed","Not Full-Time Education",4600,0.72899999999999998,0.10199999999999999]
["Na h-Eileanan SiarInactiveAll","Na h-Eileanan Siar","Inactive","All",600,0.27100000000000002,0.13100000000000001,"*"]
["Na h-Eileanan SiarILO UnemployedAll","Na h-Eileanan Siar","ILO Unemployed","All",0,0,0,"***"]
["Na h-Eileanan SiarEmployedAll","Na h-Eileanan Siar","Employed","All",1600,0.68700000000000006,0.13700000000000001]
["Na h-Eileanan SiarILO UnemployedNot Full-Time Education","Na h-Eileanan Siar","ILO Unemployed","Not Full-Time Education",0,0,0,"***"]
["Na h-Eileanan SiarInactiveNot Full-Time Education","Na h-Eileanan Siar","Inactive","Not Full-Time Education",100,0.105,".","*"]
["Na h-Eileanan SiarEmployedNot Full-Time Education","Na h-Eileanan Siar","Employed","Not Full-Time Education",900,0.80200000000000005,0.17899999999999999,"*"]
["North AyrshireInactiveAll","North Ayrshire","Inactive","All",4600,0.34599999999999997,8.5000000000000006E-2]
["North AyrshireILO UnemployedAll","North Ayrshire","ILO Unemployed","All",1300,0.155,8.1000000000000003E-2,"*"]
["North AyrshireEmployedAll","North Ayrshire","Employed","All",7300,0.55300000000000005,8.8999999999999996E-2]
["North AyrshireEmployedNot Full-Time Education","North Ayrshire","Employed","Not Full-Time Education",5700,0.71399999999999997,0.107]
["North AyrshireInactiveNot Full-Time Education","North Ayrshire","Inactive","Not Full-Time Education",1200,0.153,8.5999999999999993E-2,"*"]
["North AyrshireILO UnemployedNot Full-Time Education","North Ayrshire","ILO Unemployed","Not Full-Time Education",1100,0.157,9.4E-2,"*"]
["North LanarkshireInactiveAll","North Lanarkshire","Inactive","All",11900,0.33600000000000002,7.0000000000000007E-2]
["North LanarkshireILO UnemployedAll","North Lanarkshire","ILO Unemployed","All",1900,8.1000000000000003E-2,0.05,"*"]
[{"$f":"B130&C130&D130","v":"North LanarkshireEmployedAll"},"North Lanarkshire","Employed","All",21700,0.61099999999999999,7.1999999999999995E-2]
["North LanarkshireInactiveNot Full-Time Education","North Lanarkshire","Inactive","Not Full-Time Education",3800,0.16800000000000001,7.0999999999999994E-2,"*"]
["North LanarkshireILO UnemployedNot Full-Time Education","North Lanarkshire","ILO Unemployed","Not Full-Time Education",1800,9.4E-2,0.06,"*"]
["North LanarkshireEmployedNot Full-Time Education","North Lanarkshire","Employed","Not Full-Time Education",17200,0.754,8.2000000000000003E-2]
["Orkney IslandsInactiveAll","Orkney Islands","Inactive","All",500,0.26500000000000001,0.21,"*"]
["Orkney IslandsILO UnemployedAll","Orkney Islands","ILO Unemployed","All",0,0,0,"***"]
["Orkney IslandsEmployedAll","Orkney Islands","Employed","All",1400,0.73499999999999999,0.21,"*"]
["Orkney IslandsInactiveNot Full-Time Education","Orkney Islands","Inactive","Not Full-Time Education",0,0,0,"***"]
["Orkney IslandsILO UnemployedNot Full-Time Education","Orkney Islands","ILO Unemployed","Not Full-Time Education",0,0,0,"***"]
["Orkney IslandsEmployedNot Full-Time Education","Orkney Islands","Employed","Not Full-Time Education",1100,0.80100000000000005,".","*"]
["Perth and KinrossInactiveAll","Perth and Kinross","Inactive","All",3700,0.27100000000000002,6.7000000000000004E-2]
["Perth and KinrossILO UnemployedAll","Perth and Kinross","ILO Unemployed","All",800,7.6999999999999999E-2,4.8000000000000001E-2,"*"]
["Perth and KinrossEmployedAll","Perth and Kinross","Employed","All",9300,0.67300000000000004,7.0999999999999994E-2]
["Perth and KinrossILO UnemployedNot Full-Time Education","Perth and Kinross","ILO Unemployed","Not Full-Time Education",500,6.7000000000000004E-2,5.0999999999999997E-2,"*"]
["Perth and KinrossInactiveNot Full-Time Education","Perth and Kinross","Inactive","Not Full-Time Education",1100,0.11700000000000001,6.2E-2,"*"]
["Perth and KinrossEmployedNot Full-Time Education","Perth and Kinross","Employed","Not Full-Time Education",7600,0.82399999999999995,7.2999999999999995E-2]
["RenfrewshireInactiveAll","Renfrewshire","Inactive","All",5900,0.33200000000000002,7.4999999999999997E-2]
["RenfrewshireILO UnemployedAll","Renfrewshire","ILO Unemployed","All",1400,0.122,6.3E-2,"*"]
["RenfrewshireEmployedAll","Renfrewshire","Employed","All",10400,0.58699999999999997,7.8E-2]
["RenfrewshireInactiveNot Full-Time Education","Renfrewshire","Inactive","Not Full-Time Education",1100,0.12,7.2999999999999995E-2,"*"]
["RenfrewshireILO UnemployedNot Full-Time Education","Renfrewshire","ILO Unemployed","Not Full-Time Education",700,0.09,6.9000000000000006E-2,"*"]
["RenfrewshireEmployedNot Full-Time Education","Renfrewshire","Employed","Not Full-Time Education",7100,0.8,0.09]
["ScotlandEmployedAll","Scotland","Employed","All",315900,0.55900000000000005,1.4999999999999999E-2]
["ScotlandILO UnemployedAll","Scotland","ILO Unemployed","All",30900,8.8999999999999996E-2,1.0999999999999999E-2]
["ScotlandInactiveAll","Scotland","Inactive","All",218800,0.38700000000000001,1.4999999999999999E-2]
["ScotlandInactiveNot Full-Time Education","Scotland","Inactive","Not Full-Time Education",55300,0.17899999999999999,1.6E-2]
["ScotlandILO UnemployedNot Full-Time Education","Scotland","ILO Unemployed","Not Full-Time Education",21500,8.5000000000000006E-2,1.2999999999999999E-2]
["ScotlandEmployedNot Full-Time Education","Scotland","Employed","Not Full-Time Education",232400,0.752,1.7999999999999999E-2]
["Scottish BordersInactiveAll","Scottish Borders","Inactive","All",3800,0.38,8.2000000000000003E-2]
["Scottish BordersILO UnemployedAll","Scottish Borders","ILO Unemployed","All",500,7.3999999999999996E-2,5.7000000000000002E-2,"*"]
["Scottish BordersEmployedAll","Scottish Borders","Employed","All",5700,0.57399999999999995,8.3000000000000004E-2]
["Scottish BordersILO UnemployedNot Full-Time Education","Scottish Borders","ILO Unemployed","Not Full-Time Education",500,8.5000000000000006E-2,6.6000000000000003E-2,"*"]
[{"$f":"B162&C162&D162","v":"Scottish BordersInactiveNot Full-Time Education"},"Scottish Borders","Inactive","Not Full-Time Education",1100,0.16600000000000001,8.1000000000000003E-2,"*"]
["Scottish BordersEmployedNot Full-Time Education","Scottish Borders","Employed","Not Full-Time Education",4900,0.76300000000000001,9.2999999999999999E-2]
["Shetland IslandsInactiveAll","Shetland Islands","Inactive","All",1100,0.35499999999999998,0.27100000000000002,"*"]
["Shetland IslandsILO UnemployedAll","Shetland Islands","ILO Unemployed","All",0,0,0,"***"]
["Shetland IslandsEmployedAll","Shetland Islands","Employed","All",1800,0.56699999999999995,0.28000000000000003,"*"]
["Shetland IslandsInactiveNot Full-Time Education","Shetland Islands","Inactive","Not Full-Time Education",0,0,0,"***"]
["Shetland IslandsILO UnemployedNot Full-Time Education","Shetland Islands","ILO Unemployed","Not Full-Time Education",0,0,0,"***"]
["Shetland IslandsEmployedNot Full-Time Education","Shetland Islands","Employed","Not Full-Time Education",800,0.76800000000000002,".","*"]
["South AyrshireInactiveAll","South Ayrshire","Inactive","All",3100,0.29799999999999999,8.5000000000000006E-2]
["South AyrshireILO UnemployedAll","South Ayrshire","ILO Unemployed","All",700,9.0999999999999998E-2,6.5000000000000002E-2,"*"]
["South AyrshireEmployedAll","South Ayrshire","Employed","All",6500,0.63800000000000001,8.8999999999999996E-2]
["South AyrshireILO UnemployedNot Full-Time Education","South Ayrshire","ILO Unemployed","Not Full-Time Education",400,6.8000000000000005E-2,6.7000000000000004E-2,"*"]
["South AyrshireInactiveNot Full-Time Education","South Ayrshire","Inactive","Not Full-Time Education",500,8.4000000000000005E-2,7.0999999999999994E-2,"*"]
["South AyrshireEmployedNot Full-Time Education","South Ayrshire","Employed","Not Full-Time Education",4800,0.85399999999999998,0.09]
["South LanarkshireInactiveAll","South Lanarkshire","Inactive","All",11300,0.37,0.08]
["South LanarkshireILO UnemployedAll","South Lanarkshire","ILO Unemployed","All",1600,8.1000000000000003E-2,5.8999999999999997E-2,"*"]
["South LanarkshireEmployedAll","South Lanarkshire","Employed","All",17600,0.57899999999999996,8.2000000000000003E-2]
["South LanarkshireInactiveNot Full-Time Education","South Lanarkshire","Inactive","Not Full-Time Education",2800,0.14099999999999999,7.3999999999999996E-2,"*"]
["South LanarkshireILO UnemployedNot Full-Time Education","South Lanarkshire","ILO Unemployed","Not Full-Time Education",1400,8.4000000000000005E-2,6.4000000000000001E-2,"*"]
["South LanarkshireEmployedNot Full-Time Education","South Lanarkshire","Employed","Not Full-Time Education",15500,0.78700000000000003,8.6999999999999994E-2]
["StirlingInactiveAll","Stirling","Inactive","All",4600,0.36799999999999999,8.2000000000000003E-2]
["StirlingILO UnemployedAll","Stirling","ILO Unemployed","All",400,5.6000000000000001E-2,0.05,"*"]
["StirlingEmployedAll","Stirling","Employed","All",7500,0.59699999999999998,8.3000000000000004E-2]
["StirlingInactiveNot Full-Time Education","Stirling","Inactive","Not Full-Time Education",700,0.12,0.08,"*"]
["StirlingILO UnemployedNot Full-Time Education","Stirling","ILO Unemployed","Not Full-Time Education",200,4.5999999999999999E-2,".","*"]
["StirlingEmployedNot Full-Time Education","Stirling","Employed","Not Full-Time Education",4800,0.84,0.09]
["West DunbartonshireInactiveAll","West Dunbartonshire","Inactive","All",3000,0.33700000000000002,7.3999999999999996E-2]
["West DunbartonshireILO UnemployedAll","West Dunbartonshire","ILO Unemployed","All",900,0.15,6.9000000000000006E-2,"*"]
["West DunbartonshireEmployedAll","West Dunbartonshire","Employed","All",4900,0.56299999999999994,7.8E-2]
["West DunbartonshireInactiveNot Full-Time Education","West Dunbartonshire","Inactive","Not Full-Time Education",900,0.16300000000000001,7.2999999999999995E-2,"*"]
["West DunbartonshireILO UnemployedNot Full-Time Education","West Dunbartonshire","ILO Unemployed","Not Full-Time Education",600,0.13300000000000001,7.2999999999999995E-2,"*"]
["West DunbartonshireEmployedNot Full-Time Education","West Dunbartonshire","Employed","Not Full-Time Education",4100,0.72599999999999998,8.7999999999999995E-2]
[{"$f":"B194&C194&D194","v":"West LothianInactiveAll"},"West Lothian","Inactive","All",6600,0.36,7.6999999999999999E-2]
["West LothianILO UnemployedAll","West Lothian","ILO Unemployed","All",1000,8.5999999999999993E-2,5.7000000000000002E-2,"*"]
["West LothianEmployedAll","West Lothian","Employed","All",10600,0.58499999999999996,7.9000000000000001E-2]
["West LothianInactiveNot Full-Time Education","West Lothian","Inactive","Not Full-Time Education",1700,0.156,7.8E-2,"*"]
["West LothianILO UnemployedNot Full-Time Education","West Lothian","ILO Unemployed","Not Full-Time Education",700,7.8E-2,6.3E-2,"*"]
["West LothianEmployedNot Full-Time Education","West Lothian","Employed","Not Full-Time Education",8700,0.77800000000000002,8.8999999999999996E-2]

{"sheet":"Main Table","index":12,"n_rows":74,"n_cols":76,"rows_kept":74,"cut":false,"hidden":true,"merged":[]}
[null,2,3,4,5,6,7,8,9,10,11,12,13,14,15,16,17,18,19,20,21,22,23,24,25,26,27,28,29,30,31,32,33,34,35,36,37,38,39,40,41,42,43,44,45,46,47,48,49,50,51,52,53,54,55,56,57,58,59,60,61,62,63,64,65,66,67,68,69,70,71,72,73,74,75,76]
[null,"All","All","All","All","All","All","All","All","All","All","All","All","All","All","All","Employed","Employed","Employed","Employed","Employed","Employed","Employed","Employed","Employed","Employed","Employed","Employed","Employed","Employed","Employed","ILO Unemployed","ILO Unemployed","ILO Unemployed","ILO Unemployed","ILO Unemployed","ILO Unemployed","ILO Unemployed","ILO Unemployed","ILO Unemployed","ILO Unemployed","ILO Unemployed","ILO Unemployed","ILO Unemployed","ILO Unemployed","ILO Unemployed","Inactive","Inactive","Inactive","Inactive","Inactive","Inactive","Inactive","Inactive","Inactive","Inactive","Inactive","Inactive","Inactive","Inactive","Inactive","Out of Work","Out of Work","Out of Work","Out of Work","Out of Work","Out of Work","Out of Work","Out of Work","Out of Work","Out of Work","Out of Work","Out of Work","Out of Work","Out of Work","Out of Work"]
[null,"All","All","All","All Education","All Education","All Education","Full-Time Education","Full-Time Education","Full-Time Education","Not Enrolled","Not Enrolled","Not Enrolled","Not Full-Time Education","Not Full-Time Education","Not Full-Time Education","All","All","All","All Education","All Education","All Education","Full-Time Education","Full-Time Education","Full-Time Education","Not Enrolled","Not Enrolled","Not Enrolled","Not Full-Time Education","Not Full-Time Education","Not Full-Time Education","All","All","All","All Education","All Education","All Education","Full-Time Education","Full-Time Education","Full-Time Education","Not Enrolled","Not Enrolled","Not Enrolled","Not Full-Time Education","Not Full-Time Education","Not Full-Time Education","All","All","All","All Education","All Education","All Education","Full-Time Education","Full-Time Education","Full-Time Education","Not Enrolled","Not Enrolled","Not Enrolled","Not Full-Time Education","Not Full-Time Education","Not Full-Time Education","All","All","All","All Education","All Education","All Education","Full-Time Education","Full-Time Education","Full-Time Education","Not Enrolled","Not Enrolled","Not Enrolled","Not Full-Time Education","Not Full-Time Education","Not Full-Time Education"]
[null,"Level","Rate","CI","Level","Rate","CI","Level","Rate","CI","Level","Rate","CI","Level","Rate","CI","Level","Rate","CI","Level","Rate","CI","Level","Rate","CI","Level","Rate","CI","Level","Rate","CI","Level","Rate","CI","Level","Rate","CI","Level","Rate","CI","Level","Rate","CI","Level","Rate","CI","Level","Rate","CI","Level","Rate","CI","Level","Rate","CI","Level","Rate","CI","Level","Rate","CI","Level","Rate","CI","Level","Rate","CI","Level","Rate","CI","Level","Rate","CI","Level","Rate","CI"]
["Aberdeen City",28400,1,0,16700,0.58899999999999997,8.8999999999999996E-2,0,0,0,11700,0.41099999999999998,8.8999999999999996E-2,0,0,0,null,null,null,7900,0.27800000000000002,8.1000000000000003E-2,0,0,0,7500,0.26500000000000001,0.08,0,0,0,null,null,null,1000,3.5000000000000003E-2,3.3000000000000002E-2,0,0,0,1100,3.9E-2,3.5000000000000003E-2,0,0,0,null,null,null,7800,0.27600000000000002,8.1000000000000003E-2,0,0,0,3000,0.106,5.6000000000000001E-2,0,0,0,null,null,null,8800,0.311,8.4000000000000005E-2,0,0,0,4100,0.14599999999999999,6.4000000000000001E-2,0,0,0]
["Aberdeenshire",23500,1,0,12800,0.54700000000000004,8.5999999999999993E-2,11000,0.46899999999999997,8.5999999999999993E-2,10500,0.44700000000000001,8.5000000000000006E-2,1800,7.9000000000000001E-2,4.5999999999999999E-2,null,null,null,6800,0.28899999999999998,7.8E-2,4900,0.21,7.0000000000000007E-2,9100,0.38900000000000001,8.4000000000000005E-2,1800,7.9000000000000001E-2,4.5999999999999999E-2,null,null,null,0,0,0,0,0,0,700,2.9000000000000001E-2,".",0,0,0,null,null,null,0,0,0,0,0,0,700,2.9000000000000001E-2,".",0,0,0,null,null,null,6100,0.25900000000000001,7.4999999999999997E-2,6100,0.25900000000000001,7.4999999999999997E-2,1400,5.8000000000000003E-2,0.04,0,0,0]
["Angus",10700,1,0,5700,0.52800000000000002,7.5999999999999998E-2,4800,0.45,7.5999999999999998E-2,4900,0.46200000000000002,7.5999999999999998E-2,800,7.9000000000000001E-2,4.1000000000000002E-2,null,null,null,2400,0.221,6.4000000000000001E-2,1600,0.14699999999999999,5.3999999999999999E-2,3400,0.32,7.0999999999999994E-2,800,7.3999999999999996E-2,0.04,null,null,null,200,2.1999999999999999E-2,".",200,2.1999999999999999E-2,".",300,2.7E-2,2.5000000000000001E-2,0,0,0,null,null,null,3100,0.28499999999999998,6.9000000000000006E-2,3000,0.28100000000000003,6.9000000000000006E-2,1200,0.115,4.9000000000000002E-2,0,0,0,null,null,null,3300,0.307,7.0999999999999994E-2,3200,0.30299999999999999,7.0000000000000007E-2,1500,0.14199999999999999,5.2999999999999999E-2,0,0,0]
["Argyll and Bute",7600,1,0,3300,0.433,9.2999999999999999E-2,2800,0.372,9.0999999999999998E-2,4200,0.55900000000000005,9.2999999999999999E-2,500,6.0999999999999999E-2,4.4999999999999998E-2,null,null,null,1300,0.16800000000000001,7.0000000000000007E-2,900,0.113,5.8999999999999997E-2,3200,0.41799999999999998,9.2999999999999999E-2,400,5.5E-2,4.2999999999999997E-2,null,null,null,0,0,0,0,0,0,200,2.1999999999999999E-2,".",0,0,0,null,null,null,0,0,0,0,0,0,900,0.11899999999999999,6.0999999999999999E-2,0,0,0,null,null,null,2000,0.26600000000000001,8.3000000000000004E-2,2000,0.26,8.2000000000000003E-2,1100,0.14099999999999999,6.5000000000000002E-2,0,0,0]
["City of Edinburgh",62100,1,0,36200,0.58299999999999996,6.6000000000000003E-2,34500,0.55600000000000005,6.7000000000000004E-2,25600,0.41199999999999998,6.6000000000000003E-2,1700,2.8000000000000001E-2,2.1999999999999999E-2,null,null,null,13600,0.22,5.6000000000000001E-2,12300,0.19700000000000001,5.3999999999999999E-2,19300,0.311,6.2E-2,1400,2.1999999999999999E-2,0.02,null,null,null,1300,0.02,1.9E-2,1300,0.02,1.9E-2,1400,2.1999999999999999E-2,0.02,0,0,0,null,null,null,21300,0.34300000000000003,6.4000000000000001E-2,21000,0.33800000000000002,6.4000000000000001E-2,4800,7.8E-2,3.5999999999999997E-2,0,0,0,null,null,null,22600,0.36399999999999999,6.5000000000000002E-2,22300,0.35799999999999998,6.5000000000000002E-2,6200,0.1,0.04,0,0,0]
["Clackmannanshire",3700,1,0,1600,0.44500000000000001,0.104,0,0,0,2000,0.55500000000000005,0.104,0,0,0,null,null,null,600,0.17399999999999999,7.9000000000000001E-2,0,0,0,1600,0.42499999999999999,0.10299999999999999,0,0,0,null,null,null,0,0,0,0,0,0,200,6.5000000000000002E-2,5.0999999999999997E-2,0,0,0,null,null,null,0,0,0,0,0,0,200,6.5000000000000002E-2,5.1999999999999998E-2,0,0,0,null,null,null,1000,0.27100000000000002,9.2999999999999999E-2,0,0,0,500,0.13,7.0000000000000007E-2,0,0,0]
["Dumfries and Galloway",13000,1,0,6000,0.45700000000000002,9.0999999999999998E-2,5100,0.39,0.09,7000,0.53700000000000003,9.1999999999999998E-2,900,6.7000000000000004E-2,4.5999999999999999E-2,null,null,null,1500,0.11799999999999999,5.8999999999999997E-2,1000,0.08,0.05,4900,0.378,8.8999999999999996E-2,500,3.6999999999999998E-2,3.5000000000000003E-2,null,null,null,0,0,0,0,0,0,800,6.4000000000000001E-2,4.4999999999999998E-2,0,0,0,null,null,null,0,0,0,0,0,0,1200,9.4E-2,5.3999999999999999E-2,0,0,0,null,null,null,4400,0.33900000000000002,8.6999999999999994E-2,4000,0.31,8.5000000000000006E-2,2100,0.159,6.7000000000000004E-2,400,2.9000000000000001E-2,"."]
["Dundee City",19900,1,0,12800,0.64400000000000002,6.2E-2,12100,0.60799999999999998,6.3E-2,7000,0.35,6.0999999999999999E-2,700,3.5999999999999997E-2,2.4E-2,null,null,null,4400,0.219,5.2999999999999999E-2,3900,0.19400000000000001,5.0999999999999997E-2,5600,0.28299999999999997,5.8000000000000003E-2,500,2.5000000000000001E-2,0.02,null,null,null,1100,5.3999999999999999E-2,2.9000000000000001E-2,1100,5.3999999999999999E-2,2.9000000000000001E-2,600,3.2000000000000001E-2,2.3E-2,0,0,0,null,null,null,7400,0.371,6.2E-2,7200,0.36,6.2E-2,700,3.5000000000000003E-2,2.4E-2,0,0,0,null,null,null,8500,0.42499999999999999,6.4000000000000001E-2,8300,0.41399999999999998,6.3E-2,1300,6.7000000000000004E-2,3.2000000000000001E-2,200,1.0999999999999999E-2,"."]
["East Ayrshire",11600,1,0,4600,0.39100000000000001,8.3000000000000004E-2,4300,0.37,8.2000000000000003E-2,6900,0.59099999999999997,8.4000000000000005E-2,200,2.1000000000000001E-2,2.4E-2,null,null,null,1400,0.123,5.6000000000000001E-2,1200,0.10199999999999999,5.1999999999999998E-2,5100,0.438,8.5000000000000006E-2,200,2.1000000000000001E-2,".",null,null,null,0,0,0,0,0,0,800,7.2999999999999995E-2,4.3999999999999997E-2,0,0,0,null,null,null,0,0,0,0,0,0,900,8.1000000000000003E-2,4.7E-2,0,0,0,null,null,null,3100,0.26900000000000002,7.5999999999999998E-2,3100,0.26900000000000002,7.5999999999999998E-2,1800,0.154,6.2E-2,0,0,0]
["East Dunbartonshire",10300,1,0,5700,0.55700000000000005,7.0999999999999994E-2,5300,0.51600000000000001,7.0999999999999994E-2,4500,0.44,7.0999999999999994E-2,400,4.1000000000000002E-2,2.8000000000000001E-2,null,null,null,1700,0.16300000000000001,5.2999999999999999E-2,1500,0.14299999999999999,0.05,3600,0.35099999999999998,6.8000000000000005E-2,200,0.02,".",null,null,null,0,0,0,0,0,0,0,0,0,0,0,0,null,null,null,0,0,0,0,0,0,0,0,0,0,0,0,null,null,null,4100,0.39500000000000002,7.0000000000000007E-2,3800,0.373,6.9000000000000006E-2,900,8.8999999999999996E-2,4.1000000000000002E-2,200,2.1000000000000001E-2,0.02]
["East Lothian",9900,1,0,4900,0.49099999999999999,9.0999999999999998E-2,4400,0.44,0.09,5000,0.503,9.0999999999999998E-2,500,5.0999999999999997E-2,0.04,null,null,null,2300,0.23300000000000001,7.6999999999999999E-2,1800,0.183,7.0000000000000007E-2,3500,0.35199999999999998,8.6999999999999994E-2,500,5.0999999999999997E-2,0.04,null,null,null,0,0,0,0,0,0,500,4.5999999999999999E-2,3.7999999999999999E-2,0,0,0,null,null,null,0,0,0,0,0,0,1000,0.105,5.6000000000000001E-2,0,0,0,null,null,null,2600,0.25800000000000001,7.9000000000000001E-2,2600,0.25800000000000001,7.9000000000000001E-2,1500,0.151,6.5000000000000002E-2,0,0,0]
["East Renfrewshire",9600,1,0,6300,0.65900000000000003,7.4999999999999997E-2,6100,0.63500000000000001,7.5999999999999998E-2,3300,0.34100000000000003,7.4999999999999997E-2,200,2.5000000000000001E-2,2.5000000000000001E-2,null,null,null,1500,0.152,5.7000000000000002E-2,1300,0.13400000000000001,5.3999999999999999E-2,2400,0.248,6.8000000000000005E-2,0,0,0,null,null,null,0,0,0,0,0,0,300,3.3000000000000002E-2,2.8000000000000001E-2,0,0,0,null,null,null,0,0,0,0,0,0,600,0.06,3.6999999999999998E-2,0,0,0,null,null,null,4900,0.50700000000000001,7.9000000000000001E-2,4800,0.501,7.9000000000000001E-2,900,9.2999999999999999E-2,4.5999999999999999E-2,0,0,0]
["Falkirk",15400,1,0,5100,0.33400000000000002,0.08,4700,0.30599999999999999,7.8E-2,10200,0.66200000000000003,0.08,400,2.7E-2,2.8000000000000001E-2,null,null,null,1900,0.123,5.6000000000000001E-2,1500,9.6000000000000002E-2,0.05,6900,0.45,8.5000000000000006E-2,400,2.7E-2,".",null,null,null,0,0,0,0,0,0,1200,7.9000000000000001E-2,4.5999999999999999E-2,0,0,0,null,null,null,0,0,0,0,0,0,2100,0.13300000000000001,5.8000000000000003E-2,0,0,0,null,null,null,3200,0.21099999999999999,6.9000000000000006E-2,3200,0.21099999999999999,6.9000000000000006E-2,3300,0.21199999999999999,6.9000000000000006E-2,0,0,0]
["Fife",39300,1,0,18800,0.47899999999999998,7.8E-2,16100,0.41,7.6999999999999999E-2,20000,0.50900000000000001,7.8E-2,2700,6.9000000000000006E-2,0.04,null,null,null,5400,0.13700000000000001,5.3999999999999999E-2,3000,7.4999999999999997E-2,4.1000000000000002E-2,14300,0.36299999999999999,7.4999999999999997E-2,2400,6.2E-2,3.7999999999999999E-2,null,null,null,0,0,0,0,0,0,1900,4.9000000000000002E-2,3.4000000000000002E-2,0,0,0,null,null,null,0,0,0,0,0,0,3800,9.7000000000000003E-2,4.5999999999999999E-2,0,0,0,null,null,null,13400,0.34200000000000003,7.3999999999999996E-2,13200,0.33500000000000002,7.3999999999999996E-2,5700,0.14599999999999999,5.5E-2,0,0,0]
["Glasgow City",76500,1,0,38600,0.504,5.7000000000000002E-2,36800,0.48099999999999998,5.7000000000000002E-2,37800,0.49399999999999999,5.7000000000000002E-2,1800,2.3E-2,1.7000000000000001E-2,null,null,null,11600,0.152,4.1000000000000002E-2,10900,0.14199999999999999,0.04,24400,0.32,5.2999999999999999E-2,700,8.9999999999999993E-3,".",null,null,null,2300,0.03,0.02,1800,2.3E-2,1.7000000000000001E-2,1600,2.1999999999999999E-2,1.7000000000000001E-2,0,0,0,null,null,null,24700,0.32300000000000001,5.3999999999999999E-2,24100,0.315,5.2999999999999999E-2,11700,0.153,4.1000000000000002E-2,0,0,0,null,null,null,27000,0.35199999999999998,5.5E-2,25900,0.33800000000000002,5.3999999999999999E-2,13300,0.17399999999999999,4.3999999999999997E-2,1100,1.4E-2,1.2999999999999999E-2]
["Highland",20900,1,0,7900,0.376,0.114,0,0,0,12900,0.61699999999999999,0.115,0,0,0,null,null,null,3200,0.15,8.4000000000000005E-2,0,0,0,11700,0.55800000000000005,0.11700000000000001,0,0,0,null,null,null,0,0,0,0,0,0,0,0,0,0,0,0,null,null,null,0,0,0,0,0,0,0,0,0,0,0,0,null,null,null,4700,0.22500000000000001,9.9000000000000005E-2,0,0,0,1200,5.8999999999999997E-2,5.6000000000000001E-2,0,0,0]
["Inverclyde",7600,1,0,3900,0.51200000000000001,9.5000000000000001E-2,3600,0.47599999999999998,9.5000000000000001E-2,3600,0.47699999999999998,9.5000000000000001E-2,300,3.5999999999999997E-2,3.5000000000000003E-2,null,null,null,1200,0.154,6.8000000000000005E-2,1000,0.128,6.3E-2,2800,0.36799999999999999,9.0999999999999998E-2,200,2.5000000000000001E-2,".",null,null,null,0,0,0,0,0,0,400,5.1999999999999998E-2,4.2000000000000003E-2,0,0,0,null,null,null,0,0,0,0,0,0,400,5.8000000000000003E-2,4.3999999999999997E-2,0,0,0,null,null,null,2700,0.35799999999999998,9.0999999999999998E-2,2600,0.34799999999999998,0.09,800,0.11,5.8999999999999997E-2,0,0,0]
["Midlothian",8400,1,0,4500,0.52800000000000002,9.9000000000000005E-2,4200,0.497,9.9000000000000005E-2,3900,0.45900000000000002,9.9000000000000005E-2,300,3.1E-2,3.4000000000000002E-2,null,null,null,1500,0.17299999999999999,7.4999999999999997E-2,1200,0.14099999999999999,6.9000000000000006E-2,3200,0.38100000000000001,9.6000000000000002E-2,300,3.1E-2,".",null,null,null,300,3.9E-2,3.7999999999999999E-2,300,3.9E-2,3.7999999999999999E-2,200,2.7E-2,".",0,0,0,null,null,null,2700,0.317,9.1999999999999998E-2,2700,0.317,9.1999999999999998E-2,400,0.05,4.2999999999999997E-2,0,0,0,null,null,null,3000,0.35599999999999998,9.5000000000000001E-2,3000,0.35599999999999998,9.5000000000000001E-2,700,7.6999999999999999E-2,5.2999999999999999E-2,0,0,0]
["Moray",9100,1,0,3100,0.34599999999999997,8.5999999999999993E-2,2800,0.31,8.3000000000000004E-2,5800,0.64400000000000002,8.5999999999999993E-2,300,3.5999999999999997E-2,3.4000000000000002E-2,null,null,null,1200,0.13200000000000001,6.0999999999999999E-2,1100,0.121,5.8999999999999997E-2,4500,0.49199999999999999,0.09,0,0,0,null,null,null,0,0,0,0,0,0,400,4.3999999999999997E-2,3.6999999999999998E-2,0,0,0,null,null,null,0,0,0,0,0,0,1000,0.108,5.6000000000000001E-2,0,0,0,null,null,null,1900,0.214,7.3999999999999996E-2,1700,0.189,7.0999999999999994E-2,1400,0.152,6.5000000000000002E-2,0,0,0]
["Na h-Eileanan Siar",2300,1,0,1500,0.64800000000000002,0.14099999999999999,1300,0.54500000000000004,0.14699999999999999,800,0.35199999999999998,0.14099999999999999,200,0.10299999999999999,0.09,null,null,null,900,0.38800000000000001,0.14399999999999999,800,0.32300000000000001,0.13800000000000001,700,0.3,0.13500000000000001,200,6.5000000000000002E-2,".",null,null,null,0,0,0,0,0,0,0,0,0,0,0,0,null,null,null,0,0,0,0,0,0,0,0,0,0,0,0,null,null,null,600,0.26100000000000001,0.13,500,0.223,0.123,0,0,0,0,0,0]
["North Ayrshire",13200,1,0,5900,0.44600000000000001,8.8999999999999996E-2,5100,0.38200000000000001,8.6999999999999994E-2,7000,0.52900000000000003,8.8999999999999996E-2,800,6.4000000000000001E-2,4.3999999999999997E-2,null,null,null,2200,0.16900000000000001,6.7000000000000004E-2,1700,0.126,5.8999999999999997E-2,5000,0.378,8.6999999999999994E-2,600,4.3999999999999997E-2,3.6999999999999998E-2,null,null,null,400,2.8000000000000001E-2,".",0,0,0,1000,7.2999999999999995E-2,4.7E-2,0,0,0,null,null,null,3300,0.249,7.6999999999999999E-2,0,0,0,1000,7.6999999999999999E-2,4.8000000000000001E-2,0,0,0,null,null,null,3700,0.27700000000000002,0.08,3400,0.25700000000000001,7.8E-2,2000,0.151,6.4000000000000001E-2,300,0.02,"."]
["North Lanarkshire",35500,1,0,13800,0.38900000000000001,7.1999999999999995E-2,12700,0.35799999999999998,7.0999999999999994E-2,21700,0.61099999999999999,7.1999999999999995E-2,1100,3.1E-2,2.5999999999999999E-2,null,null,null,5600,0.157,5.3999999999999999E-2,4500,0.127,4.9000000000000002E-2,16100,0.45300000000000001,7.3999999999999996E-2,1100,3.1E-2,2.5999999999999999E-2,null,null,null,0,0,0,0,0,0,1800,0.05,3.2000000000000001E-2,0,0,0,null,null,null,0,0,0,0,0,0,3800,0.108,4.5999999999999999E-2,0,0,0,null,null,null,8200,0.23100000000000001,6.2E-2,8200,0.23100000000000001,6.2E-2,5600,0.158,5.3999999999999999E-2,0,0,0]
["Orkney Islands",1900,1,0,600,0.32300000000000001,0.222,0,0,0,1000,0.53300000000000003,0.23699999999999999,0,0,0,null,null,null,400,0.20200000000000001,0.191,0,0,0,1000,0.53300000000000003,0.23699999999999999,0,0,0,null,null,null,0,0,0,0,0,0,0,0,0,0,0,0,null,null,null,0,0,0,0,0,0,0,0,0,0,0,0,null,null,null,0,0,0,0,0,0,0,0,0,0,0,0]
["Perth and Kinross",13800,1,0,5300,0.38600000000000001,7.2999999999999995E-2,4600,0.33500000000000002,7.0999999999999994E-2,8500,0.61399999999999999,7.2999999999999995E-2,700,0.05,3.3000000000000002E-2,null,null,null,2100,0.155,5.5E-2,1700,0.125,0.05,7200,0.51800000000000002,7.4999999999999997E-2,400,0.03,2.5999999999999999E-2,null,null,null,200,1.7000000000000001E-2,".",200,1.7000000000000001E-2,".",500,3.9E-2,2.9000000000000001E-2,0,0,0,null,null,null,3000,0.214,6.2E-2,2700,0.193,0.06,800,5.7000000000000002E-2,3.5000000000000003E-2,0,0,0,null,null,null,3200,0.23,6.3E-2,2900,0.21,6.0999999999999999E-2,1300,9.6000000000000002E-2,4.3999999999999997E-2,0,0,0]
["Renfrewshire",17700,1,0,9500,0.53500000000000003,7.9000000000000001E-2,8700,0.49399999999999999,7.9000000000000001E-2,8200,0.46200000000000002,7.9000000000000001E-2,700,4.1000000000000002E-2,3.1E-2,null,null,null,3900,0.219,6.6000000000000003E-2,3300,0.184,6.0999999999999999E-2,6500,0.36799999999999999,7.5999999999999998E-2,600,3.5000000000000003E-2,2.9000000000000001E-2,null,null,null,800,4.8000000000000001E-2,3.4000000000000002E-2,700,4.2000000000000003E-2,3.2000000000000001E-2,600,3.4000000000000002E-2,2.9000000000000001E-2,0,0,0,null,null,null,4700,0.26800000000000002,7.0000000000000007E-2,4700,0.26800000000000002,7.0000000000000007E-2,1100,0.06,3.7999999999999999E-2,0,0,0,null,null,null,5600,0.316,7.3999999999999996E-2,5500,0.31,7.2999999999999995E-2,1700,9.4E-2,4.5999999999999999E-2,0,0,0]
["Scotland",565500,1,0,274500,0.48499999999999999,1.4999999999999999E-2,254900,0.45100000000000001,1.4999999999999999E-2,287400,0.50800000000000001,1.4999999999999999E-2,19700,3.5000000000000003E-2,6.0000000000000001E-3,null,null,null,98700,0.17499999999999999,1.0999999999999999E-2,83500,0.14799999999999999,1.0999999999999999E-2,215900,0.38200000000000001,1.4999999999999999E-2,15200,2.7E-2,5.0000000000000001E-3,null,null,null,10000,1.7999999999999999E-2,4.0000000000000001E-3,9400,1.7000000000000001E-2,4.0000000000000001E-3,20800,3.6999999999999998E-2,6.0000000000000001E-3,700,1E-3,".",null,null,null,165800,0.29299999999999998,1.4E-2,162000,0.28699999999999998,1.4E-2,50700,0.09,8.9999999999999993E-3,3800,7.0000000000000001E-3,2E-3,null,null,null,175800,0.311,1.4E-2,171400,0.30299999999999999,1.4E-2,71500,0.126,0.01,4400,8.0000000000000002E-3,3.0000000000000001E-3]
["Scottish Borders",9900,1,0,3900,0.39,8.2000000000000003E-2,3500,0.35299999999999998,8.1000000000000003E-2,6000,0.60499999999999998,8.2000000000000003E-2,400,3.6999999999999998E-2,3.2000000000000001E-2,null,null,null,1100,0.106,5.1999999999999998E-2,800,8.1000000000000003E-2,4.5999999999999999E-2,4600,0.46800000000000003,8.4000000000000005E-2,300,2.5000000000000001E-2,".",null,null,null,0,0,0,0,0,0,500,4.5999999999999999E-2,3.5000000000000003E-2,0,0,0,null,null,null,0,0,0,0,0,0,900,9.0999999999999998E-2,4.9000000000000002E-2,0,0,0,null,null,null,2800,0.28399999999999997,7.5999999999999998E-2,2700,0.27300000000000002,7.4999999999999997E-2,1400,0.13700000000000001,5.8000000000000003E-2,0,0,0]
["Shetland Islands",3100,1,0,1800,0.58499999999999996,0.27900000000000003,0,0,0,1100,0.33400000000000002,0.26700000000000002,0,0,0,null,null,null,1000,0.311,0.26200000000000001,0,0,0,800,0.25600000000000001,0.247,0,0,0,null,null,null,0,0,0,0,0,0,0,0,0,0,0,0,null,null,null,0,0,0,0,0,0,0,0,0,0,0,0,null,null,null,900,0.27400000000000002,0.252,0,0,0,0,0,0,0,0,0]
["South Ayrshire",10200,1,0,4600,0.44700000000000001,9.1999999999999998E-2,0,0,0,5700,0.55300000000000005,9.1999999999999998E-2,0,0,0,null,null,null,1700,0.16500000000000001,6.9000000000000006E-2,0,0,0,4800,0.47299999999999998,9.2999999999999999E-2,0,0,0,null,null,null,300,0.03,".",0,0,0,400,3.4000000000000002E-2,".",0,0,0,null,null,null,2600,0.252,8.1000000000000003E-2,0,0,0,500,4.5999999999999999E-2,3.9E-2,0,0,0,null,null,null,2900,0.28100000000000003,8.4000000000000005E-2,0,0,0,800,8.1000000000000003E-2,5.0999999999999997E-2,0,0,0]
["South Lanarkshire",30400,1,0,11300,0.372,0.08,0,0,0,19100,0.628,0.08,0,0,0,null,null,null,2500,8.1000000000000003E-2,4.4999999999999998E-2,0,0,0,15100,0.498,8.3000000000000004E-2,0,0,0,null,null,null,0,0,0,0,0,0,1400,4.5999999999999999E-2,3.5000000000000003E-2,0,0,0,null,null,null,0,0,0,0,0,0,2500,8.4000000000000005E-2,4.5999999999999999E-2,0,0,0,null,null,null,8900,0.29099999999999998,7.4999999999999997E-2,0,0,0,4000,0.13,5.6000000000000001E-2,0,0,0]
["Stirling",12600,1,0,7200,0.56899999999999995,8.4000000000000005E-2,6700,0.53500000000000003,8.4000000000000005E-2,5200,0.41099999999999998,8.3000000000000004E-2,400,3.5000000000000003E-2,3.1E-2,null,null,null,3000,0.23599999999999999,7.1999999999999995E-2,2700,0.214,6.9000000000000006E-2,4500,0.36,8.1000000000000003E-2,300,2.1999999999999999E-2,".",null,null,null,200,1.7000000000000001E-2,".",200,1.7000000000000001E-2,".",200,1.7999999999999999E-2,".",0,0,0,null,null,null,4000,0.316,7.9000000000000001E-2,3800,0.30299999999999999,7.8E-2,400,3.3000000000000002E-2,0.03,0,0,0,null,null,null,4200,0.33300000000000002,0.08,4000,0.32,7.9000000000000001E-2,600,5.0999999999999997E-2,3.6999999999999998E-2,0,0,0]
["West Dunbartonshire",8800,1,0,3200,0.36899999999999999,7.5999999999999998E-2,3100,0.35,7.4999999999999997E-2,5500,0.626,7.5999999999999998E-2,200,1.9E-2,2.1000000000000001E-2,null,null,null,900,0.104,4.8000000000000001E-2,800,0.09,4.4999999999999998E-2,4000,0.45400000000000001,7.8E-2,0,0,0,null,null,null,0,0,0,0,0,0,600,7.1999999999999995E-2,0.04,0,0,0,null,null,null,0,0,0,0,0,0,900,0.1,4.7E-2,0,0,0,null,null,null,2300,0.26400000000000001,6.9000000000000006E-2,2300,0.26,6.9000000000000006E-2,1500,0.17199999999999999,5.8999999999999997E-2,0,0,0]
["West Lothian",18200,1,0,7300,0.4,7.9000000000000001E-2,7000,0.38300000000000001,7.8E-2,10800,0.59699999999999998,7.9000000000000001E-2,300,1.7000000000000001E-2,2.1000000000000001E-2,null,null,null,2200,0.121,5.1999999999999998E-2,1900,0.104,4.9000000000000002E-2,8400,0.46,0.08,300,1.7000000000000001E-2,".",null,null,null,300,1.4E-2,".",300,1.4E-2,".",700,4.1000000000000002E-2,3.2000000000000001E-2,0,0,0,null,null,null,4800,0.26400000000000001,7.0999999999999994E-2,4800,0.26400000000000001,7.0999999999999994E-2,1700,9.6000000000000002E-2,4.7E-2,0,0,0,null,null,null,5100,0.27800000000000002,7.1999999999999995E-2,5100,0.27800000000000002,7.1999999999999995E-2,2500,0.13700000000000001,5.5E-2,0,0,0]
[]
[null,"All","All","All","All","All","All","All","All","All","All","All","All","All","All","All","Employed","Employed","Employed","Employed","Employed","Employed","Employed","Employed","Employed","Employed","Employed","Employed","Employed","Employed","Employed","ILO Unemployed","ILO Unemployed","ILO Unemployed","ILO Unemployed","ILO Unemployed","ILO Unemployed","ILO Unemployed","ILO Unemployed","ILO Unemployed","ILO Unemployed","ILO Unemployed","ILO Unemployed","ILO Unemployed","ILO Unemployed","ILO Unemployed","Inactive","Inactive","Inactive","Inactive","Inactive","Inactive","Inactive","Inactive","Inactive","Inactive","Inactive","Inactive","Inactive","Inactive","Inactive","Out of Work","Out of Work","Out of Work","Out of Work","Out of Work","Out of Work","Out of Work","Out of Work","Out of Work","Out of Work","Out of Work","Out of Work","Out of Work","Out of Work","Out of Work"]
[null,"All","All","All","All Education","All Education","All Education","Full-Time Education","Full-Time Education","Full-Time Education","Not Enrolled","Not Enrolled","Not Enrolled","Not Full-Time Education","Not Full-Time Education","Not Full-Time Education","All","All","All","All Education","All Education","All Education","Full-Time Education","Full-Time Education","Full-Time Education","Not Enrolled","Not Enrolled","Not Enrolled","Not Full-Time Education","Not Full-Time Education","Not Full-Time Education","All","All","All","All Education","All Education","All Education","Full-Time Education","Full-Time Education","Full-Time Education","Not Enrolled","Not Enrolled","Not Enrolled","Not Full-Time Education","Not Full-Time Education","Not Full-Time Education","All","All","All","All Education","All Education","All Education","Full-Time Education","Full-Time Education","Full-Time Education","Not Enrolled","Not Enrolled","Not Enrolled","Not Full-Time Education","Not Full-Time Education","Not Full-Time Education","All","All","All","All Education","All Education","All Education","Full-Time Education","Full-Time Education","Full-Time Education","Not Enrolled","Not Enrolled","Not Enrolled","Not Full-Time Education","Not Full-Time Education","Not Full-Time Education"]
[null,"Level","Rate","CI","Level","Rate","CI","Level","Rate","CI","Level","Rate","CI","Level","Rate","CI","Level","Rate","CI","Level","Rate","CI","Level","Rate","CI","Level","Rate","CI","Level","Rate","CI","Level","Rate","CI","Level","Rate","CI","Level","Rate","CI","Level","Rate","CI","Level","Rate","CI","Level","Rate","CI","Level","Rate","CI","Level","Rate","CI","Level","Rate","CI","Level","Rate","CI","Level","Rate","CI","Level","Rate","CI","Level","Rate","CI","Level","Rate","CI","Level","Rate","CI"]
["Aberdeen City",null,null,null,null,null,null,"***","***","***",null,null,null,"***","***","***",null,null,null,null,null,null,"***","***","***",null,null,null,"***","***","***",null,null,null,"*","*","*","***","***","***","*","*","*","***","***","***",null,null,null,null,null,null,"***","***","***","*","*","*","***","***","***",null,null,null,null,null,null,"***","***","***","*","*","*","***","***","***"]
["Aberdeenshire",null,null,null,null,null,null,null,null,null,null,null,null,"*","*","*",null,null,null,null,null,null,null,null,null,null,null,null,"*","*","*",null,null,null,"***","***","***","***","***","***","*","*","*","***","***","***",null,null,null,"***","***","***","***","***","***","*","*","*","***","***","***",null,null,null,null,null,null,null,null,null,"*","*","*","***","***","***"]
["Angus",null,null,null,null,null,null,null,null,null,null,null,null,"*","*","*",null,null,null,null,null,null,"*","*","*",null,null,null,"*","*","*",null,null,null,"*","*","*","*","*","*","*","*","*","***","***","***",null,null,null,null,null,null,null,null,null,"*","*","*","***","***","***",null,null,null,null,null,null,null,null,null,"*","*","*","***","***","***"]
["Argyll and Bute",null,null,null,null,null,null,null,null,null,null,null,null,"*","*","*",null,null,null,"*","*","*","*","*","*",null,null,null,"*","*","*",null,null,null,"***","***","***","***","***","***","*","*","*","***","***","***",null,null,null,"***","***","***","***","***","***","*","*","*","***","***","***",null,null,null,null,null,null,null,null,null,"*","*","*","***","***","***"]
["City of Edinburgh",null,null,null,null,null,null,null,null,null,null,null,null,"*","*","*",null,null,null,null,null,null,null,null,null,null,null,null,"*","*","*",null,null,null,"*","*","*","*","*","*","*","*","*","***","***","***",null,null,null,null,null,null,null,null,null,"*","*","*","***","***","***",null,null,null,null,null,null,null,null,null,"*","*","*","***","***","***"]
["Clackmannanshire",null,null,null,null,null,null,"***","***","***",null,null,null,"***","***","***",null,null,null,"*","*","*","***","***","***",null,null,null,"***","***","***",null,null,null,"***","***","***","***","***","***","*","*","*","***","***","***",null,null,null,"***","***","***","***","***","***","*","*","*","***","***","***",null,null,null,null,null,null,"***","***","***","*","*","*","***","***","***"]
["Dumfries and Galloway",null,null,null,null,null,null,null,null,null,null,null,null,"*","*","*",null,null,null,"*","*","*","*","*","*",null,null,null,"*","*","*",null,null,null,"***","***","***","***","***","***","*","*","*","***","***","***",null,null,null,"***","***","***","***","***","***","*","*","*","***","***","***",null,null,null,null,null,null,null,null,null,"*","*","*","*","*","*"]
["Dundee City",null,null,null,null,null,null,null,null,null,null,null,null,"*","*","*",null,null,null,null,null,null,null,null,null,null,null,null,"*","*","*",null,null,null,"*","*","*","*","*","*","*","*","*","***","***","***",null,null,null,null,null,null,null,null,null,"*","*","*","***","***","***",null,null,null,null,null,null,null,null,null,"*","*","*","*","*","*"]
["East Ayrshire",null,null,null,null,null,null,null,null,null,null,null,null,"*","*","*",null,null,null,"*","*","*","*","*","*",null,null,null,"*","*","*",null,null,null,"***","***","***","***","***","***","*","*","*","***","***","***",null,null,null,"***","***","***","***","***","***","*","*","*","***","***","***",null,null,null,null,null,null,null,null,null,"*","*","*","***","***","***"]
["East Dunbartonshire",null,null,null,null,null,null,null,null,null,null,null,null,"*","*","*",null,null,null,null,null,null,"*","*","*",null,null,null,"*","*","*",null,null,null,"***","***","***","***","***","***","***","***","***","***","***","***",null,null,null,"***","***","***","***","***","***","***","***","***","***","***","***",null,null,null,null,null,null,null,null,null,"*","*","*","*","*","*"]
["East Lothian",null,null,null,null,null,null,null,null,null,null,null,null,"*","*","*",null,null,null,null,null,null,"*","*","*",null,null,null,"*","*","*",null,null,null,"***","***","***","***","***","***","*","*","*","***","***","***",null,null,null,"***","***","***","***","***","***","*","*","*","***","***","***",null,null,null,null,null,null,null,null,null,"*","*","*","***","***","***"]
["East Renfrewshire",null,null,null,null,null,null,null,null,null,null,null,null,"*","*","*",null,null,null,"*","*","*","*","*","*",null,null,null,"***","***","***",null,null,null,"***","***","***","***","***","***","*","*","*","***","***","***",null,null,null,"***","***","***","***","***","***","*","*","*","***","***","***",null,null,null,null,null,null,null,null,null,"*","*","*","***","***","***"]
["Falkirk",null,null,null,null,null,null,null,null,null,null,null,null,"*","*","*",null,null,null,"*","*","*","*","*","*",null,null,null,"*","*","*",null,null,null,"***","***","***","***","***","***","*","*","*","***","***","***",null,null,null,"***","***","***","***","***","***","*","*","*","***","***","***",null,null,null,null,null,null,null,null,null,"*","*","*","***","***","***"]
["Fife",null,null,null,null,null,null,null,null,null,null,null,null,"*","*","*",null,null,null,"*","*","*","*","*","*",null,null,null,"*","*","*",null,null,null,"***","***","***","***","***","***","*","*","*","***","***","***",null,null,null,"***","***","***","***","***","***","*","*","*","***","***","***",null,null,null,null,null,null,null,null,null,"*","*","*","***","***","***"]
["Glasgow City",null,null,null,null,null,null,null,null,null,null,null,null,"*","*","*",null,null,null,null,null,null,null,null,null,null,null,null,"*","*","*",null,null,null,"*","*","*","*","*","*","*","*","*","***","***","***",null,null,null,null,null,null,null,null,null,null,null,null,"***","***","***",null,null,null,null,null,null,null,null,null,null,null,null,"*","*","*"]
["Highland",null,null,null,null,null,null,"***","***","***",null,null,null,"***","***","***",null,null,null,"*","*","*","***","***","***",null,null,null,"***","***","***",null,null,null,"***","***","***","***","***","***","***","***","***","***","***","***",null,null,null,"***","***","***","***","***","***","***","***","***","***","***","***",null,null,null,"*","*","*","***","***","***","*","*","*","***","***","***"]
["Inverclyde",null,null,null,null,null,null,null,null,null,null,null,null,"*","*","*",null,null,null,"*","*","*","*","*","*",null,null,null,"*","*","*",null,null,null,"***","***","***","***","***","***","*","*","*","***","***","***",null,null,null,"***","***","***","***","***","***","*","*","*","***","***","***",null,null,null,null,null,null,null,null,null,"*","*","*","***","***","***"]
["Midlothian",null,null,null,null,null,null,null,null,null,null,null,null,"*","*","*",null,null,null,"*","*","*","*","*","*",null,null,null,"*","*","*",null,null,null,"*","*","*","*","*","*","*","*","*","***","***","***",null,null,null,null,null,null,null,null,null,"*","*","*","***","***","***",null,null,null,null,null,null,null,null,null,"*","*","*","***","***","***"]
["Moray",null,null,null,null,null,null,null,null,null,null,null,null,"*","*","*",null,null,null,"*","*","*","*","*","*",null,null,null,"***","***","***",null,null,null,"***","***","***","***","***","***","*","*","*","***","***","***",null,null,null,"***","***","***","***","***","***","*","*","*","***","***","***",null,null,null,null,null,null,null,null,null,"*","*","*","***","***","***"]
["Na h-Eileanan Siar",null,null,null,null,null,null,"*","*","*","*","*","*","*","*","*",null,null,null,"*","*","*","*","*","*","*","*","*","*","*","*",null,null,null,"***","***","***","***","***","***","***","***","***","***","***","***",null,null,null,"***","***","***","***","***","***","***","***","***","***","***","***",null,null,null,"*","*","*","*","*","*","***","***","***","***","***","***"]
["North Ayrshire",null,null,null,null,null,null,null,null,null,null,null,null,"*","*","*",null,null,null,"*","*","*","*","*","*",null,null,null,"*","*","*",null,null,null,"*","*","*","***","***","***","*","*","*","***","***","***",null,null,null,null,null,null,"***","***","***","*","*","*","***","***","***",null,null,null,null,null,null,null,null,null,"*","*","*","*","*","*"]
["North Lanarkshire",null,null,null,null,null,null,null,null,null,null,null,null,"*","*","*",null,null,null,null,null,null,"*","*","*",null,null,null,"*","*","*",null,null,null,"***","***","***","***","***","***","*","*","*","***","***","***",null,null,null,"***","***","***","***","***","***","*","*","*","***","***","***",null,null,null,null,null,null,null,null,null,"*","*","*","***","***","***"]
["Orkney Islands","*","*","*","*","*","*","***","***","***","*","*","*","***","***","***",null,null,null,"*","*","*","***","***","***","*","*","*","***","***","***",null,null,null,"***","***","***","***","***","***","***","***","***","***","***","***",null,null,null,"***","***","***","***","***","***","***","***","***","***","***","***",null,null,null,"***","***","***","***","***","***","***","***","***","***","***","***"]
["Perth and Kinross",null,null,null,null,null,null,null,null,null,null,null,null,"*","*","*",null,null,null,null,null,null,"*","*","*",null,null,null,"*","*","*",null,null,null,"*","*","*","*","*","*","*","*","*","***","***","***",null,null,null,null,null,null,null,null,null,"*","*","*","***","***","***",null,null,null,null,null,null,null,null,null,"*","*","*","***","***","***"]
["Renfrewshire",null,null,null,null,null,null,null,null,null,null,null,null,"*","*","*",null,null,null,null,null,null,null,null,null,null,null,null,"*","*","*",null,null,null,"*","*","*","*","*","*","*","*","*","***","***","***",null,null,null,null,null,null,null,null,null,"*","*","*","***","***","***",null,null,null,null,null,null,null,null,null,"*","*","*","***","***","***"]
["Scotland",null,null,null,null,null,null,null,null,null,null,null,null,null,null,null,null,null,null,null,null,null,null,null,null,null,null,null,null,null,null,null,null,null,null,null,null,null,null,null,null,null,null,"*","*","*"]
["Scottish Borders",null,null,null,null,null,null,null,null,null,null,null,null,"*","*","*",null,null,null,"*","*","*","*","*","*",null,null,null,"*","*","*",null,null,null,"***","***","***","***","***","***","*","*","*","***","***","***",null,null,null,"***","***","***","***","***","***","*","*","*","***","***","***",null,null,null,null,null,null,null,null,null,"*","*","*","***","***","***"]
["Shetland Islands","*","*","*","*","*","*","***","***","***","*","*","*","***","***","***",null,null,null,"*","*","*","***","***","***","*","*","*","***","***","***",null,null,null,"***","***","***","***","***","***","***","***","***","***","***","***",null,null,null,"***","***","***","***","***","***","***","***","***","***","***","***",null,null,null,"*","*","*","***","***","***","***","***","***","***","***","***"]
["South Ayrshire",null,null,null,null,null,null,"***","***","***",null,null,null,"***","***","***",null,null,null,"*","*","*","***","***","***",null,null,null,"***","***","***",null,null,null,"*","*","*","***","***","***","*","*","*","***","***","***",null,null,null,null,null,null,"***","***","***","*","*","*","***","***","***",null,null,null,null,null,null,"***","***","***","*","*","*","***","***","***"]
["South Lanarkshire",null,null,null,null,null,null,"***","***","***",null,null,null,"***","***","***",null,null,null,"*","*","*","***","***","***",null,null,null,"***","***","***",null,null,null,"***","***","***","***","***","***","*","*","*","***","***","***",null,null,null,"***","***","***","***","***","***","*","*","*","***","***","***",null,null,null,null,null,null,"***","***","***","*","*","*","***","***","***"]
["Stirling",null,null,null,null,null,null,null,null,null,null,null,null,"*","*","*",null,null,null,null,null,null,"*","*","*",null,null,null,"*","*","*",null,null,null,"*","*","*","*","*","*","*","*","*","***","***","***",null,null,null,null,null,null,null,null,null,"*","*","*","***","***","***",null,null,null,null,null,null,null,null,null,"*","*","*","***","***","***"]
["West Dunbartonshire",null,null,null,null,null,null,null,null,null,null,null,null,"*","*","*",null,null,null,"*","*","*","*","*","*",null,null,null,"***","***","***",null,null,null,"***","***","***","***","***","***","*","*","*","***","***","***",null,null,null,"***","***","***","***","***","***","*","*","*","***","***","***",null,null,null,null,null,null,null,null,null,null,null,null,"***","***","***"]
["West Lothian",null,null,null,null,null,null,null,null,null,null,null,null,"*","*","*",null,null,null,"*","*","*","*","*","*",null,null,null,"*","*","*",null,null,null,"*","*","*","*","*","*","*","*","*","***","***","***",null,null,null,null,null,null,null,null,null,"*","*","*","***","***","***",null,null,null,null,null,null,null,null,null,"*","*","*","***","***","***"]