{"text_format":"1","workbook":"xlsx","n_sheets":13,"sheets":["Area Profile","Underlying Data","Background Note","Contacts","Processing","Claimant Count","Participation","Employment","ASHE","Sector","Qualifications","Education","Main Table"],"not_rendered":{"charts":8,"images":3,"macros":1,"external_links":0,"defined_names":3,"comments":0,"pivot_tables":0},"unopened":[],"bounds":{"document_bytes":16777216,"sheet_cells":100000,"rows_first":2000,"rows_last":500,"rows_between":2000,"halvings":0,"cell_chars":16384,"cell_head_chars":4096},"cells_cut":0,"cells_raw":0,"read":"whole","date_system":"1900"}

{"sheet":"Area Profile","index":0,"n_rows":104,"n_cols":12,"rows_kept":104,"cut":false,"hidden":false,"merged":[[25,1,25,5],[18,1,18,5],[25,7,25,11],[23,1,24,5],[23,7,24,11],[19,1,22,11],[103,1,104,5],[78,4,79,7],[78,8,79,11],[100,1,101,5],[99,6,100,7],[103,6,104,7],[101,6,102,7],[1,1,2,5],[54,4,56,6],[54,0,56,3],[31,1,32,5],[31,7,32,11],[54,7,56,12],[29,1,29,11],[1,7,1,11],[2,7,2,11],[3,10,3,11],[14,10,14,11],[13,10,13,11],[12,10,12,11],[11,10,11,11],[10,10,10,11],[9,10,9,11],[3,1,3,3],[3,4,3,5],[8,10,8,11],[7,10,7,11],[6,10,6,11],[3,8,3,9],[5,10,5,11],[4,10,4,11],[6,3,6,5],[5,8,5,9],[4,8,4,9],[7,8,7,9],[8,8,8,9],[6,8,6,9],[5,1,5,5],[6,1,6,2],[10,1,12,5],[7,1,9,5],[13,1,17,5],[15,7,17,11],[14,8,14,9],[9,8,9,9],[13,8,13,9],[12,8,12,9],[11,8,11,9],[10,8,10,9]]}
[]
[null,"Young Person’s Local Authority\nLabour Market Dashboard",null,null,null,null,null,{"$f":"Processing!E159","v":"565,500"}]
[null,null,null,null,null,null,null,{"$f":"Processing!E160","v":"16 to 24 year olds in Scotland"}]
[null,null,null,null,"2021-12-01",null,null,{"$f":"Processing!E161","v":"FT Education"},{"$f":"Processing!F161","v":"PT Education"},null,{"$f":"Processing!G161","v":"Not in Education"}]
[null,null,null,null,null,null,null,{"$f":"Processing!E162","v":"254,900"},{"$f":"Processing!F162","v":"19,700"},null,{"$f":"Processing!G162","v":"287,400"}]
[null,"Data for Local Authorities has been collated and can be viewed by selecting",null,null,null,null,null,{"$f":"Processing!E163","v":"(45.1 per cent)"},{"$f":"Processing!F163","v":"(3.5 per cent)"},null,{"$f":"Processing!G163","v":"(50.8 per cent)"}]
[null,"from the drop down box:",null,"Scotland",null,null,null,{"$f":"Processing!E164","v":"83,500"},{"$f":"Processing!F164","v":"15,200"},null,{"$f":"Processing!G164","v":"215,900"}]
[null,"Summary Trends in the labour market for young people are of importance given the long-term impact unemployment at a young age can have on individuals and the economy.",null,null,null,null,null,{"$f":"Processing!E165","v":"in employment"},{"$f":"Processing!F165","v":"in employment"},null,{"$f":"Processing!G165","v":"in employment"}]
{"$rows_left_out":97}
{"sheet":"Underlying Data","index":1,"n_rows":172,"n_cols":18,"rows_kept":172,"cut":false,"hidden":false,"merged":[[44,1,45,10],[37,1,38,16],[112,6,112,7],[113,6,113,7],[93,6,94,13],[106,6,106,7],[107,6,107,7],[108,6,108,7],[109,6,109,7],[110,6,110,7],[101,6,101,7],[102,6,102,7],[103,6,103,7],[46,8,46,10],[71,9,71,10],[70,8,70,10],[83,3,83,4],[83,6,83,7],[83,9,83,10],[56,1,57,10],[164,6,164,7],[71,6,71,7],[70,2,70,4],[70,5,70,7],[157,3,157,4],[157,6,157,7],[104,6,104,7],[105,6,105,7],[97,6,97,7],[98,6,98,7],[99,6,99,7],[100,6,100,7],[96,3,96,4],[132,1,133,4],[93,1,94,4],[21,14,21,16],[22,15,22,16],[58,5,58,7],[58,8,58,10],[59,3,59,4],[59,6,59,7],[59,9,59,10],[22,12,22,13],[22,6,22,7],[22,9,22,10],[47,3,47,4],[47,6,47,7],[58,2,58,4],[47,9,47,10],[46,2,46,4],[46,5,46,7],[1,1,2,6],[3,4,3,6],[11,1,11,2],[5,1,5,6],[6,2,6,6],[12,1,17,16],[9,1,9,16],[8,1,8,16],[96,12,96,13],[95,11,95,13],[82,5,82,7],[82,2,82,4],[83,12,83,13],[82,11,82,13],[82,8,82,10],[21,8,21,10],[21,11,21,13],[21,2,21,4],[22,3,22,4],[21,5,21,7],[71,3,71,4],[167,1,168,7],[95,2,95,4],[96,9,96,10],[95,8,95,10],[156,6,156,7],[156,3,156,4],[155,6,155,7],[111,6,111,7],[155,3,155,4],[166,3,166,4],[166,6,166,7],[165,3,165,4],[164,3,164,4],[163,2,163,4],[163,5,163,7],[165,6,165,7]]}
[]
[null,"Young Person’s Local Authority\nLabour Market Dashboard"]
[]
[null,null,null,null,"2021-12-01"]
[]
[null,"Data for Local Authorities has been collated and can be viewed by selecting"]
[null,"from the drop down box:","Scotland"]
[]
{"$rows_left_out":165}
{"sheet":"Background Note","index":2,"n_rows":86,"n_cols":16,"rows_kept":86,"cut":false,"hidden":false,"merged":[[34,1,50,13],[20,1,30,13],[31,1,33,13],[5,1,5,15],[8,1,19,13],[8,14,19,14],[8,15,19,15],[1,1,1,3],[1,5,1,9],[68,1,69,13],[70,1,84,13],[3,1,4,15],[53,15,69,15],[53,14,69,14],[70,15,86,15],[70,14,86,14],[34,15,52,15],[34,14,52,14],[85,1,86,13],[20,15,33,15],[20,14,33,14],[51,1,52,13],[53,1,67,13]]}
[]
[null,"Background Note"]
[]
[null,"There are various information sources relating to young people in the labour market shown in this dashboard for local authorities in Scotland.  Further methodological information is shown below with regard to the time period they currently refer to, frequency and timing of next update.  "]
[]
[null,"The Scottish Government publish a report on young people in the labour market each quarter using the latest data from the Annual Population Survey.  The most recent report can be viewed on the Scottish Government website."]
[]
[null,null,null,null,null,null,null,null,null,null,null,null,null,null,"Time Period","Next Update"]
{"$rows_left_out":79}
{"sheet":"Contacts","index":3,"n_rows":13,"n_cols":2,"rows_kept":13,"cut":false,"hidden":false,"merged":[[12,1,12,9],[10,1,10,9],[9,1,9,9],[1,1,1,4],[3,1,3,9],[4,1,4,9],[5,1,5,9],[7,1,7,9]]}
[]
[null,"Correspondence and enquiries"]
[]
[null,"For enquiries or any feedback on the content of this publication please contact:"]
[null,"Labour Market Analysis Unit"]
[null,"Office of the Chief Economic Advisor"]
[]
[null,"e-mail: lmstats@gov.scot"]
{"$rows_left_out":6}
{"sheet":"Processing","index":4,"n_rows":343,"n_cols":29,"rows_kept":343,"cut":false,"hidden":true,"merged":[[158,22,158,24],[172,10,172,12],[172,13,172,15],[172,16,172,18],[172,19,172,21],[172,22,172,24],[158,10,158,12],[158,13,158,15],[158,16,158,18],[158,19,158,21],[139,4,139,6],[140,4,140,6],[140,19,140,22],[139,19,139,22],[140,14,140,17],[139,14,139,17],[139,9,139,12],[140,9,140,12],[262,20,262,21],[262,18,262,19],[34,6,34,7],[34,8,34,9],[34,10,34,11],[158,4,158,6],[159,4,159,6],[96,7,96,11],[71,17,71,19],[71,9,71,11],[50,9,50,10],[50,11,50,12],[71,6,71,8],[71,14,71,16],[96,15,96,19],[118,4,118,7],[138,4,138,7],[118,9,118,12],[138,9,138,12],[118,14,118,17],[118,19,118,22],[138,14,138,17],[138,19,138,22],[120,19,120,22],[119,19,119,22],[120,14,120,17],[119,14,119,17],[120,9,120,12],[119,9,119,12],[119,4,119,7],[120,4,120,7]]}
[]
[null,"Scotland",null,null,"Claimant Count"]
[null,"Aberdeen City",null,null,{"$f":"'Area Profile'!D7","v":"Scotland"},null,null,2,null,3,4,5,6,7,8,9,10,11,12,13,14,15]
[null,"Aberdeenshire",null,null,null,null,"Levels",{"$f":"'Claimant Count'!B49","v":"2019-10-01"},null,{"$f":"'Claimant Count'!C49","v":"2020-10-01"},{"$f":"'Claimant Count'!D49","v":"2020-11-01"},{"$f":"'Claimant Count'!E49","v":"2020-12-01"},{"$f":"'Claimant Count'!F49","v":"2021-01-01"},{"$f":"'Claimant Count'!G49","v":"2021-02-01"},{"$f":"'Claimant Count'!H49","v":"2021-03-01"},{"$f":"'Claimant Count'!I49","v":"2021-04-01"},{"$f":"'Claimant Count'!J49","v":"2021-05-01"},{"$f":"'Claimant Count'!K49","v":"2021-06-01"},{"$f":"'Claimant Count'!L49","v":"2021-07-01"},{"$f":"'Claimant Count'!M49","v":"2021-08-01"},{"$f":"'Claimant Count'!N49","v":"2021-09-01"},{"$f":"'Claimant Count'!O49","v":"2021-10-01"}]
[null,"Angus",null,null,"Series",null,{"$f":"E3","v":"Scotland"},{"$f":"VLOOKUP($G$5,'Claimant Count'!$A$8:$O$41,H3,FALSE)","v":21095},null,{"$f":"VLOOKUP($G$5,'Claimant Count'!$A$8:$O$41,J3,FALSE)","v":41090},{"$f":"VLOOKUP($G$5,'Claimant Count'!$A$8:$O$41,K3,FALSE)","v":40065},{"$f":"VLOOKUP($G$5,'Claimant Count'!$A$8:$O$41,L3,FALSE)","v":39220},{"$f":"VLOOKUP($G$5,'Claimant Count'!$A$8:$O$41,M3,FALSE)","v":38965},{"$f":"VLOOKUP($G$5,'Claimant Count'!$A$8:$O$41,N3,FALSE)","v":40050},{"$f":"VLOOKUP($G$5,'Claimant Count'!$A$8:$O$41,O3,FALSE)","v":40665},{"$f":"VLOOKUP($G$5,'Claimant Count'!$A$8:$O$41,P3,FALSE)","v":39760},{"$f":"VLOOKUP($G$5,'Claimant Count'!$A$8:$O$41,Q3,FALSE)","v":36820},{"$f":"VLOOKUP($G$5,'Claimant Count'!$A$8:$O$41,R3,FALSE)","v":34060},{"$f":"VLOOKUP($G$5,'Claimant Count'!$A$8:$O$41,S3,FALSE)","v":33215},{"$f":"VLOOKUP($G$5,'Claimant Count'!$A$8:$O$41,T3,FALSE)","v":31315},{"$f":"VLOOKUP($G$5,'Claimant Count'!$A$8:$O$41,U3,FALSE)","v":27445},{"$f":"VLOOKUP($G$5,'Claimant Count'!$A$8:$O$41,V3,FALSE)","v":25480}]
[null,"Argyll and Bute",null,null,{"$f":"Processing!G5&\" \"&Processing!G4","v":"Scotland Levels"},null,{"$f":"IF($E$3=\"Scotland\",\"\",\"Scotland\")","v":""},{"$f":"IF($G$6=\"\",-1,VLOOKUP($G$6,'Claimant Count'!$A$8:$O$41,H3,FALSE))","v":-1},null,{"$f":"IF($G$6=\"\",-1,VLOOKUP($G$6,'Claimant Count'!$A$8:$O$41,J3,FALSE))","v":-1},{"$f":"IF($G$6=\"\",-1,VLOOKUP($G$6,'Claimant Count'!$A$8:$O$41,K3,FALSE))","v":-1},{"$f":"IF($G$6=\"\",-1,VLOOKUP($G$6,'Claimant Count'!$A$8:$O$41,L3,FALSE))","v":-1},{"$f":"IF($G$6=\"\",-1,VLOOKUP($G$6,'Claimant Count'!$A$8:$O$41,M3,FALSE))","v":-1},{"$f":"IF($G$6=\"\",-1,VLOOKUP($G$6,'Claimant Count'!$A$8:$O$41,N3,FALSE))","v":-1},{"$f":"IF($G$6=\"\",-1,VLOOKUP($G$6,'Claimant Count'!$A$8:$O$41,O3,FALSE))","v":-1},{"$f":"IF($G$6=\"\",-1,VLOOKUP($G$6,'Claimant Count'!$A$8:$O$41,P3,FALSE))","v":-1},{"$f":"IF($G$6=\"\",-1,VLOOKUP($G$6,'Claimant Count'!$A$8:$O$41,Q3,FALSE))","v":-1},{"$f":"IF($G$6=\"\",-1,VLOOKUP($G$6,'Claimant Count'!$A$8:$O$41,R3,FALSE))","v":-1},{"$f":"IF($G$6=\"\",-1,VLOOKUP($G$6,'Claimant Count'!$A$8:$O$41,S3,FALSE))","v":-1},{"$f":"IF($G$6=\"\",-1,VLOOKUP($G$6,'Claimant Count'!$A$8:$O$41,T3,FALSE))","v":-1},{"$f":"IF($G$6=\"\",-1,VLOOKUP($G$6,'Claimant Count'!$A$8:$O$41,U3,FALSE))","v":-1},{"$f":"IF($G$6=\"\",-1,VLOOKUP($G$6,'Claimant Count'!$A$8:$O$41,V3,FALSE))","v":-1}]
[null,"City of Edinburgh",null,null,{"$f":"Processing!G8&\" Rates\"","v":"Scotland Rates"},null,"Rates (per cent)",{"$f":"TEXT(H4,\"mmm\")&\" \n\"&TEXT(H4,\"yyyy\")","v":"Oct \n2019"},null,{"$f":"TEXT(J4,\"mmm\")&\" \n\"&TEXT(J4,\"yyyy\")","v":"Oct \n2020"},"Nov \n2020","Dec \n2020","Jan \n2021","Feb \n2021","Mar \n2021","Apr \n2021","May \n2021","Jun \n2021","Jul \n2021","Aug \n2021","Sep \n2021","Oct \n2021"]
[null,"Clackmannanshire",null,null,{"$f":"IF($E$3=\"Scotland\",\"\",Processing!G9&\" Rates\")","v":""},null,{"$f":"E3","v":"Scotland"},{"$f":"ROUND(VLOOKUP($G$8,'Claimant Count'!$A$49:$O$82,H3,FALSE),1)","v":3.7},null,{"$f":"ROUND(VLOOKUP($G$8,'Claimant Count'!$A$49:$O$82,J3,FALSE),1)","v":7.2},{"$f":"ROUND(VLOOKUP($G$8,'Claimant Count'!$A$49:$O$82,K3,FALSE),1)","v":7.1},{"$f":"ROUND(VLOOKUP($G$8,'Claimant Count'!$A$49:$O$82,L3,FALSE),1)","v":6.9},{"$f":"ROUND(VLOOKUP($G$8,'Claimant Count'!$A$49:$O$82,M3,FALSE),1)","v":6.9},{"$f":"ROUND(VLOOKUP($G$8,'Claimant Count'!$A$49:$O$82,N3,FALSE),1)","v":7.1},{"$f":"ROUND(VLOOKUP($G$8,'Claimant Count'!$A$49:$O$82,O3,FALSE),1)","v":7.2},{"$f":"ROUND(VLOOKUP($G$8,'Claimant Count'!$A$49:$O$82,P3,FALSE),1)","v":7},{"$f":"ROUND(VLOOKUP($G$8,'Claimant Count'!$A$49:$O$82,Q3,FALSE),1)","v":6.5},{"$f":"ROUND(VLOOKUP($G$8,'Claimant Count'!$A$49:$O$82,R3,FALSE),1)","v":6},{"$f":"ROUND(VLOOKUP($G$8,'Claimant Count'!$A$49:$O$82,S3,FALSE),1)","v":5.9},{"$f":"ROUND(VLOOKUP($G$8,'Claimant Count'!$A$49:$O$82,T3,FALSE),1)","v":5.5},{"$f":"ROUND(VLOOKUP($G$8,'Claimant Count'!$A$49:$O$82,U3,FALSE),1)","v":4.8},{"$f":"ROUND(VLOOKUP($G$8,'Claimant Count'!$A$49:$O$82,V3,FALSE),1)","v":4.5}]
{"$rows_left_out":336}
{"sheet":"Claimant Count","index":5,"n_rows":82,"n_cols":19,"rows_kept":82,"cut":false,"hidden":true,"merged":[[47,0,47,1],[6,0,6,1]]}
["Claimant count by sex and age"]
["ONS Crown Copyright Reserved [from Nomis]"]
[]
["gender","Total"]
["age","Aged 16-24"]
["measure","Claimant count"]
["Levels"]
["local authority: district / unitary","2019-10-01","2020-10-01","2020-11-01","2020-12-01","2021-01-01","2021-02-01","2021-03-01","2021-04-01","2021-05-01","2021-06-01","2021-07-01","2021-08-01","2021-09-01","2021-10-01",null,null,"Population\n2019","Population\nCurrent"]
{"$rows_left_out":75}
{"sheet":"Participation","index":6,"n_rows":68,"n_cols":7,"rows_kept":68,"cut":false,"hidden":true,"merged":[]}
[null,null,null,"Participating Status Grouped"]
["Year","Local Authority","Total Cohort (16-19)","Participating (16-19)","Participating in Education \n(16-19)","Participating in Employment (16-19)","Participating in Other Training & Development (16-19)"]
[2021,"Aberdeen City",6375,89.443137254901956,74.807843137254906,13.003921568627453,1.6313725490196078]
[2021,"Aberdeenshire",10608,92.213423831070898,75.377073906485663,15.789969834087481,1.0463800904977374]
[2021,"Angus",4792,92.445742904841396,75.521702838063447,15.630217028380637,1.2938230383973288]
[2021,"Argyll and Bute",3168,93.529040404040416,70.549242424242422,21.875,1.1047979797979799]
[2021,"Clackmannanshire",1943,89.963973237261968,67.370046320123521,18.373648996397325,4.2202779207411218]
[2021,"Dumfries and Galloway",5830,93.104631217838758,73.464837049742712,18.490566037735849,1.1492281303602059]
{"$rows_left_out":61}
{"sheet":"Employment","index":7,"n_rows":562,"n_cols":7,"rows_kept":562,"cut":false,"hidden":true,"merged":[]}
["Lookup","Year","Area","Level","SDC","Rate","CI"]
[{"$f":"B2&C2","v":"2005Aberdeen City"},2005,"Aberdeen City",19200,null,0.629,7.3999999999999996E-2]
[{"$f":"B3&C3","v":"2005Aberdeenshire"},2005,"Aberdeenshire",16100,null,0.69599999999999995,7.5999999999999998E-2]
["2005Angus",2005,"Angus",6800,null,0.65400000000000003,7.4999999999999997E-2]
["2005Argyll and Bute",2005,"Argyll and Bute",5100,null,0.65100000000000002,7.3999999999999996E-2]
["2005City of Edinburgh",2005,"City of Edinburgh",34600,null,0.53900000000000003,7.0999999999999994E-2]
["2005Clackmannanshire",2005,"Clackmannanshire",3200,null,0.72799999999999998,0.106]
["2005Dumfries and Galloway",2005,"Dumfries and Galloway",9000,null,0.67500000000000004,6.9000000000000006E-2]
{"$rows_left_out":555}
{"sheet":"ASHE","index":8,"n_rows":35,"n_cols":15,"rows_kept":35,"cut":false,"hidden":true,"merged":[[0,0,0,4],[0,6,0,10],[0,12,0,14]]}
[2011,null,null,null,null,null,2021,null,null,null,null,null,"Difference"]
["Area","16 to 24","16 and over","SDC 16 to 24","SDC 16 and over",null,"Area","16 to 24","16 and over","SDC 16 to 24","SDC 16 and over",null,"Area","16 to 24","16 and over"]
["Aberdeen City",345.8,585.70000000000005,"*",null,null,"Aberdeen City",469.6,635.6,"*",null,null,"Aberdeen City",{"$f":"IF(OR(H3=\"*\",B3=\"*\"),\"*\",ROUND(100*((H3-B3)/B3),1))","v":35.799999999999997},{"$f":"IF(OR(I3=\"*\",C3=\"*\"),\"*\",ROUND(100*((I3-C3)/C3),1))","v":8.5}]
["Aberdeenshire",338.5,481.1,"**","*",null,"Aberdeenshire","*",584.6,"***","**",null,"Aberdeenshire",{"$f":"IF(OR(H4=\"*\",B4=\"*\"),\"*\",ROUND(100*((H4-B4)/B4),1))","v":"*"},{"$f":"IF(OR(I4=\"*\",C4=\"*\"),\"*\",ROUND(100*((I4-C4)/C4),1))","v":21.5}]
["Angus","*",416.1,"***","*",null,"Angus","*",590.29999999999995,"***","*",null,"Angus","*",41.9]
["Argyll and Bute","*",495,"***","*",null,"Argyll and Bute",422.7,556,"**","*",null,"Argyll and Bute","*",12.3]
["City of Edinburgh",307.5,526.79999999999995,"*",null,null,"City of Edinburgh",415.2,639.29999999999995,"*",null,null,"City of Edinburgh",35,21.4]
["Clackmannanshire",362.9,512.6,"**","**",null,"Clackmannanshire","*",554.70000000000005,"***","*",null,"Clackmannanshire","*",8.1999999999999993]
{"$rows_left_out":28}
{"sheet":"Sector","index":9,"n_rows":166,"n_cols":7,"rows_kept":166,"cut":false,"hidden":true,"merged":[]}
["Lookup","Area","Sector","16 to 24","Rate","CI","SDC"]
[{"$f":"B2&C2","v":"Aberdeen City0. All"},"Aberdeen City","0. All",15400,0.127,2.3E-2]
[{"$f":"B3&C3","v":"Aberdeen CityA - F: Production, Agriculture & Construction"},"Aberdeen City","A - F: Production, Agriculture & Construction",1900,5.8999999999999997E-2,3.1E-2,"*"]
["Aberdeen CityG, I: Distribution, Hotels & Restaurants","Aberdeen City","G, I: Distribution, Hotels & Restaurants",8200,0.32200000000000001,7.9000000000000001E-2]
["Aberdeen CityH, J - N, R - U: Other Services","Aberdeen City","H, J - N, R - U: Other Services",3500,0.11,4.1000000000000002E-2,"*"]
["Aberdeen CityO - Q: Public Admin, Education & Health","Aberdeen City","O - Q: Public Admin, Education & Health",1400,4.4999999999999998E-2,2.7E-2,"*"]
["Aberdeenshire0. All","Aberdeenshire","0. All",15900,0.114,2.1000000000000001E-2]
["AberdeenshireA - F: Production, Agriculture & Construction","Aberdeenshire","A - F: Production, Agriculture & Construction",5000,9.6000000000000002E-2,3.2000000000000001E-2]
{"$rows_left_out":159}
{"sheet":"Qualifications","index":10,"n_rows":100,"n_cols":7,"rows_kept":100,"cut":false,"hidden":true,"merged":[]}
["Lookup","Area","Qualification","Level","Rate","CI","SDC"]
[{"$f":"B2&C2","v":"Scotland1: SVQ Level 4 and 5"},"Scotland","1: SVQ Level 4 and 5",109500,0.75600000000000001,2.7E-2]
["Scotland2: SVQ Level 2 and 3","Scotland","2: SVQ Level 2 and 3",170700,0.51600000000000001,1.9E-2]
["Scotland3: SVQ Level 1 and None","Scotland","3: SVQ Level 1 and None",18700,0.32700000000000001,4.2000000000000003E-2]
["Aberdeen City1: SVQ Level 4 and 5","Aberdeen City","1: SVQ Level 4 and 5",7000,0.80200000000000005,0.14000000000000001,"*"]
["Aberdeen City2: SVQ Level 2 and 3","Aberdeen City","2: SVQ Level 2 and 3",6700,0.43099999999999999,0.11899999999999999]
["Aberdeen City3: SVQ Level 1 and None","Aberdeen City","3: SVQ Level 1 and None",800,0.28999999999999998,0.222,"*"]
["Aberdeenshire1: SVQ Level 4 and 5","Aberdeenshire","1: SVQ Level 4 and 5",5300,0.76300000000000001,0.14499999999999999,"*"]
{"$rows_left_out":93}
{"sheet":"Education","index":11,"n_rows":199,"n_cols":8,"rows_kept":199,"cut":false,"hidden":true,"merged":[]}
["Lookup","Area","Status","Education","Level","Rate","CI","SDC"]
[{"$f":"B2&C2&D2","v":"Aberdeen CityEmployedAll"},"Aberdeen City","Employed","All",15400,0.54300000000000004,0.09]
["Aberdeen CityInactiveAll","Aberdeen City","Inactive","All",10900,0.38300000000000001,8.7999999999999995E-2]
["Aberdeen CityILO UnemployedAll","Aberdeen City","ILO Unemployed","All",2100,0.12,7.2999999999999995E-2,"*"]
["Aberdeen CityILO UnemployedNot Full-Time Education","Aberdeen City","ILO Unemployed","Not Full-Time Education",1100,0.126,9.7000000000000003E-2,"*"]
["Aberdeen CityInactiveNot Full-Time Education","Aberdeen City","Inactive","Not Full-Time Education",3200,0.26500000000000001,0.114,"*"]
["Aberdeen CityEmployedNot Full-Time Education","Aberdeen City","Employed","Not Full-Time Education",7700,0.64200000000000002,0.123]
["AberdeenshireILO UnemployedAll","Aberdeenshire","ILO Unemployed","All",700,4.2000000000000003E-2,4.1000000000000002E-2,"*"]
{"$rows_left_out":192}
{"sheet":"Main Table","index":12,"n_rows":74,"n_cols":76,"rows_kept":74,"cut":false,"hidden":true,"merged":[]}
[null,2,3,4,5,6,7,8,9,10,11,12,13,14,15,16,17,18,19,20,21,22,23,24,25,26,27,28,29,30,31,32,33,34,35,36,37,38,39,40,41,42,43,44,45,46,47,48,49,50,51,52,53,54,55,56,57,58,59,60,61,62,63,64,65,66,67,68,69,70,71,72,73,74,75,76]
[null,"All","All","All","All","All","All","All","All","All","All","All","All","All","All","All","Employed","Employed","Employed","Employed","Employed","Employed","Employed","Employed","Employed","Employed","Employed","Employed","Employed","Employed","Employed","ILO Unemployed","ILO Unemployed","ILO Unemployed","ILO Unemployed","ILO Unemployed","ILO Unemployed","ILO Unemployed","ILO Unemployed","ILO Unemployed","ILO Unemployed","ILO Unemployed","ILO Unemployed","ILO Unemployed","ILO Unemployed","ILO Unemployed","Inactive","Inactive","Inactive","Inactive","Inactive","Inactive","Inactive","Inactive","Inactive","Inactive","Inactive","Inactive","Inactive","Inactive","Inactive","Out of Work","Out of Work","Out of Work","Out of Work","Out of Work","Out of Work","Out of Work","Out of Work","Out of Work","Out of Work","Out of Work","Out of Work","Out of Work","Out of Work","Out of Work"]
[null,"All","All","All","All Education","All Education","All Education","Full-Time Education","Full-Time Education","Full-Time Education","Not Enrolled","Not Enrolled","Not Enrolled","Not Full-Time Education","Not Full-Time Education","Not Full-Time Education","All","All","All","All Education","All Education","All Education","Full-Time Education","Full-Time Education","Full-Time Education","Not Enrolled","Not Enrolled","Not Enrolled","Not Full-Time Education","Not Full-Time Education","Not Full-Time Education","All","All","All","All Education","All Education","All Education","Full-Time Education","Full-Time Education","Full-Time Education","Not Enrolled","Not Enrolled","Not Enrolled","Not Full-Time Education","Not Full-Time Education","Not Full-Time Education","All","All","All","All Education","All Education","All Education","Full-Time Education","Full-Time Education","Full-Time Education","Not Enrolled","Not Enrolled","Not Enrolled","Not Full-Time Education","Not Full-Time Education","Not Full-Time Education","All","All","All","All Education","All Education","All Education","Full-Time Education","Full-Time Education","Full-Time Education","Not Enrolled","Not Enrolled","Not Enrolled","Not Full-Time Education","Not Full-Time Education","Not Full-Time Education"]
[null,"Level","Rate","CI","Level","Rate","CI","Level","Rate","CI","Level","Rate","CI","Level","Rate","CI","Level","Rate","CI","Level","Rate","CI","Level","Rate","CI","Level","Rate","CI","Level","Rate","CI","Level","Rate","CI","Level","Rate","CI","Level","Rate","CI","Level","Rate","CI","Level","Rate","CI","Level","Rate","CI","Level","Rate","CI","Level","Rate","CI","Level","Rate","CI","Level","Rate","CI","Level","Rate","CI","Level","Rate","CI","Level","Rate","CI","Level","Rate","CI","Level","Rate","CI"]
["Aberdeen City",28400,1,0,16700,0.58899999999999997,8.8999999999999996E-2,0,0,0,11700,0.41099999999999998,8.8999999999999996E-2,0,0,0,null,null,null,7900,0.27800000000000002,8.1000000000000003E-2,0,0,0,7500,0.26500000000000001,0.08,0,0,0,null,null,null,1000,3.5000000000000003E-2,3.3000000000000002E-2,0,0,0,1100,3.9E-2,3.5000000000000003E-2,0,0,0,null,null,null,7800,0.27600000000000002,8.1000000000000003E-2,0,0,0,3000,0.106,5.6000000000000001E-2,0,0,0,null,null,null,8800,0.311,8.4000000000000005E-2,0,0,0,4100,0.14599999999999999,6.4000000000000001E-2,0,0,0]
["Aberdeenshire",23500,1,0,12800,0.54700000000000004,8.5999999999999993E-2,11000,0.46899999999999997,8.5999999999999993E-2,10500,0.44700000000000001,8.5000000000000006E-2,1800,7.9000000000000001E-2,4.5999999999999999E-2,null,null,null,6800,0.28899999999999998,7.8E-2,4900,0.21,7.0000000000000007E-2,9100,0.38900000000000001,8.4000000000000005E-2,1800,7.9000000000000001E-2,4.5999999999999999E-2,null,null,null,0,0,0,0,0,0,700,2.9000000000000001E-2,".",0,0,0,null,null,null,0,0,0,0,0,0,700,2.9000000000000001E-2,".",0,0,0,null,null,null,6100,0.25900000000000001,7.4999999999999997E-2,6100,0.25900000000000001,7.4999999999999997E-2,1400,5.8000000000000003E-2,0.04,0,0,0]
["Angus",10700,1,0,5700,0.52800000000000002,7.5999999999999998E-2,4800,0.45,7.5999999999999998E-2,4900,0.46200000000000002,7.5999999999999998E-2,800,7.9000000000000001E-2,4.1000000000000002E-2,null,null,null,2400,0.221,6.4000000000000001E-2,1600,0.14699999999999999,5.3999999999999999E-2,3400,0.32,7.0999999999999994E-2,800,7.3999999999999996E-2,0.04,null,null,null,200,2.1999999999999999E-2,".",200,2.1999999999999999E-2,".",300,2.7E-2,2.5000000000000001E-2,0,0,0,null,null,null,3100,0.28499999999999998,6.9000000000000006E-2,3000,0.28100000000000003,6.9000000000000006E-2,1200,0.115,4.9000000000000002E-2,0,0,0,null,null,null,3300,0.307,7.0999999999999994E-2,3200,0.30299999999999999,7.0000000000000007E-2,1500,0.14199999999999999,5.2999999999999999E-2,0,0,0]
["Argyll and Bute",7600,1,0,3300,0.433,9.2999999999999999E-2,2800,0.372,9.0999999999999998E-2,4200,0.55900000000000005,9.2999999999999999E-2,500,6.0999999999999999E-2,4.4999999999999998E-2,null,null,null,1300,0.16800000000000001,7.0000000000000007E-2,900,0.113,5.8999999999999997E-2,3200,0.41799999999999998,9.2999999999999999E-2,400,5.5E-2,4.2999999999999997E-2,null,null,null,0,0,0,0,0,0,200,2.1999999999999999E-2,".",0,0,0,null,null,null,0,0,0,0,0,0,900,0.11899999999999999,6.0999999999999999E-2,0,0,0,null,null,null,2000,0.26600000000000001,8.3000000000000004E-2,2000,0.26,8.2000000000000003E-2,1100,0.14099999999999999,6.5000000000000002E-2,0,0,0]
{"$rows_left_out":66}